{"text_format":"1","workbook":"xlsx","n_sheets":13,"sheets":["Control","Input","Ranges","Variables","Submodels","Report","Batch_Setup","Batch_Output","Batch_Controls","GYPSY_Observed","GYPSY_Projected","GYPSY_Report","Stop Errors"],"not_rendered":{"charts":8,"images":1,"macros":1,"external_links":0,"defined_names":637,"comments":2,"pivot_tables":0},"unopened":[],"bounds":{"document_bytes":16777216,"sheet_cells":100000,"rows_first":2000,"rows_last":500,"rows_between":2000,"halvings":0,"cell_chars":16384,"cell_head_chars":4096},"cells_cut":0,"cells_raw":0,"read":"whole","date_system":"1900"}

{"sheet":"Control","index":0,"n_rows":32,"n_cols":67,"rows_kept":32,"cut":false,"hidden":true,"merged":[]}
["App Version","2022-08-03p"]
["GYPSY available",true]
["GYPSY version","2009-May-21"]
["SAS Version","2010-Feb-26"]
["DLL Version",20100329]
["DLL Build",35]
["GYPSY Valid Input",false,"Input Valid",{"$f":"fripsy_Valid_Input(StandErrorWarning,nTwarning,PlantDataWarning,YSCperfEarlyLate,YSCzeroOutNote,YrPlantWarning,YrPrepWarning,YrThinWarning,YrWeedWarning)","v":true}]
["Stand ID"]
["Stand Type","Regenerated"]
["Stand Age",{"$f":"YSChandOut","v":18}]
["Is Spatial",true]
["BA Adjusted",true]
["Util STDOB",15]
["Util TOP DIB",10]
["Util STHT",30,"Pine total age must be a number!"]
[]
["Obs_header","gypsy_model_id","stand_id","standtype","standage","spatial","ba_known","sdob_aw","tdib_aw","stht_aw","sdob_sb","tdib_sb","stht_sb","sdob_sw","tdib_sw","stht_sw","sdob_pl","tdib_pl","stht_pl","tage_aw","bage_aw","topht_aw","den13_aw","ps_aw","ba_aw","tage_sb","bage_sb","topht_sb","den03_sb","ps_sb","ba_sb","tage_sw","bage_sw","topht_sw","den03_sw","ps_sw","ba_sw","tage_pl","bage_pl","topht_pl","den03_pl","ps_pl","ba_pl","SI_bh_aw","SI_t_aw","y2bh_aw","SDF_aw","N0_aw","PSI_aw","SI_bh_sb","SI_t_sb","y2bh_sb","SDF_sb","N0_sb","PSI_sb","SI_bh_sw","SI_t_sw","y2bh_sw","SDF_sw","N0_sw","PSI_sw","SI_bh_pl","SI_t_pl","y2bh_pl","SDF_pl","N0_pl","PSI_pl"]
[]
["Proj_header","gypsy_model_id","stand_id","standage_p","tage_aw","bage_aw","ba_aw","ps_aw","den13_aw","mden13_aw","sc_aw","topht_aw","qmd_aw","tage_sb","bage_sb","ba_sb","ps_sb","den03_sb","mden03_sb","sc_sb","topht_sb","qmd_sb","tage_sw","bage_sw","ba_sw","ps_sw","den03_sw","mden03_sw","sc_sw","topht_sw","qmd_sw","tage_pl","bage_pl","ba_pl","ps_pl","den03_pl","mden03_pl","sc_pl","topht_pl","qmd_pl","tv_aw","mv_aw","mai_aw","tv_sb","mv_sb","mai_sb","tv_sw","mv_sw","mai_sw","tv_pl","mv_pl","mai_pl","tv_con","mv_con","mai_con","tv_dec","mv_dec","mai_dec","tv_tot","mv_tot","mai_tot"]
[]
[]
["lkp","spp","b1","b2","b3","b4",null,"AWSIhand"]
["Aw","Aw",9.9088879999999993,-3.9245100000000002,-0.32778000000000002,0.134376,null,{"$f":"fripsy_GYPSY_SI(\"AW\",tophtAWhandB/100,ageAWhandB,\"T\",2)","v":14.067793469927771},{"$f":"IF(Thin=TRUE,\"Unthinned SI used!\",\"\")","v":""}]
["Pb","Pb",9.9088879999999993,-3.9245100000000002,-0.32778000000000002,0.134376]
["Bw","Bw",9.9088879999999993,-3.9245100000000002,-0.32778000000000002,0.134376]
["Sb","Sb",14.56236,-6.0470499999999996,-1.53715,0.240174]
["Sw","Sw",12.149430000000001,-3.7705099999999998,-0.28533999999999998,0.16548299999999999]
["Fb","Fb",12.149430000000001,-3.7705099999999998,-0.28533999999999998,0.16548299999999999]
["Fd","Fd",12.149430000000001,-3.7705099999999998,-0.28533999999999998,0.16548299999999999]
["Pl","Pl",12.84571,-5.7393599999999996,-0.91312000000000004,0.150668]
["Pj","Pj",12.84571,-5.7393599999999996,-0.91312000000000004,0.150668]
["Lt","Lt",12.84571,-5.7393599999999996,-0.91312000000000004,0.150668]

{"sheet":"Input","index":1,"n_rows":49,"n_cols":14,"rows_kept":49,"cut":false,"hidden":false,"merged":[[3,1,3,2]]}
[null,"Stand, Site and Establishment Factors"]
[]
[null,"Stand Identifier",null,null,null,null,"Soil Nutrient Class",null,null,null,null,"Soil Moisture Class"]
[null,"Example 1"]
[]
[null,"Natural Sub-Region",null,null,null,null,"Elevation (required)",null,null,null,null,"Latitude (required)"]
[null,null,null,null,null,null,1160,"m",null,null,null,53.5,"oN"]
[]
[null,"Depth LFH (optional)",null,null,null,null,"Slope (optional)",null,null,null,null,"Cones (optional)"]
[null,{"$f":"IF(LFHinc=TRUE,\"Yes\",\"No\")","v":"Yes"},30,"cm",null,null,{"$f":"IF(SlopeInc=TRUE,\"Yes\",\"No\")","v":"No"},null,"%",null,null,{"$f":"IF(ConesInc=TRUE,\"Yes\",\"No\")","v":"No"},null,"per m2"]
[]
[null,"Secondary Species (optional)",null,null,null,"AW",null,null,"SB",null,null,"SW"]
[null,"% stocking at establishment",null,null,null,{"$f":"IF(EsAW=TRUE,\"Yes\",\"No\")","v":"No"},null,null,{"$f":"IF(EsSB=TRUE,\"Yes\",\"No\")","v":"No"},null,null,{"$f":"IF(EsSW=TRUE,\"Yes\",\"No\")","v":"No"}]
[]
[null,null,null,null,null,null,{"$f":"StandErrorWarning","v":"Inputs for stand and site factors OK"}]
[]
[null,"Projection Options",null,null,null,null,null,null,null,null,null,{"$f":"IF(gypsy_available=TRUE,\"               GYPSY DLL version: \" & dll_version,\"               GYPSY DLL is not available!\")","v":"               GYPSY DLL version: 20100329"}]
[]
[null,null,null,"Adjust for Western Gall Rust?",{"$f":"IF(WGRadj=TRUE,\"Yes\",\"No\")","v":"No"},null,null,null,"Exclude PL natural regeneration?",{"$f":"IF(PLnExcInput=TRUE,\"Yes\",\"No\")","v":"No"},null,{"$f":"\"                     \" & L17","v":"                                    GYPSY DLL version: 20100329"}]
[]
[null,null,null,null,null,null,"Include yield projection?",{"$f":"IF(IncYieldSummary=TRUE,\"Yes\",\"No\")","v":"Yes"},null,null,null,"Include detailed GYPSY output?",{"$f":"IF(IncGYPSY=TRUE,\"Yes\",\"No\")","v":"Yes"}]
[]
[null,"Events"]
[null,"Event",null,"Selected?","Year","Stand age","Status"]
[]
[]
[null,"Cut",null,"Always",2000,{"$f":"YSCZeroOut","v":"0"},{"$f":"YSCzeroOutNote","v":"Year OK"}]
[]
[]
[null,"Site preparation",null,null,2000,{"$f":"YSCprepOut","v":0},{"$f":"YrPrepWarning","v":"Year OK"}]
[]
[]
[null,"Plant",null,{"$f":"IF(Plant=TRUE,\"Yes\",\"No\")","v":"Yes"},2001,{"$f":"YSCplantOut","v":1},{"$f":"YrPlantWarning","v":"Year OK"}]
[null,null,null,null,null,null,"      Planting density ",null,400,"trees per ha",null,"Planting advanced?",null,{"$f":"IF(Pearly=TRUE,\"Yes\",\"No\")","v":"No"}]
[null,null,null,null,null,null,{"$f":"PlantDataWarning","v":"Planting density OK"}]
[]
[]
[null,"Weed (last)",null,{"$f":"IF(Weed=TRUE,\"Yes\",\"No\")","v":"Yes"},2006,{"$f":"YSCweedOut","v":6},{"$f":"YrWeedWarning","v":"Year OK "}]
[]
[]
[null,"Thin",null,{"$f":"IF(ThinInput=TRUE,\"Yes\",\"No\")","v":"No"},2002,{"$f":"YSCthinInputOut","v":" "},{"$f":"YrThinWarning","v":"Year not required"}]
[null,null,null,null,null,null,"Post-thinning density target",null,null,4000,"trees per ha at handover"]
[null,null,null,null,null,null,{"$f":"nTwarning","v":"Thinning target not required"}]
[]
[]
[null,"Performance",null,"Always",2000,{"$f":"YSCperfOut","v":0},{"$f":"YSCperfEarlyLate","v":"Warning: performance assessment year less than 11 years after cut"}]
[]
[]
[null,"Handover",null,"Always",{"$f":"YrHandOut","v":2018},{"$f":"YSChandOut","v":18},"Fixed"]

{"sheet":"Ranges","index":2,"n_rows":4,"n_cols":4,"rows_kept":4,"cut":false,"hidden":true,"merged":[]}
["SNC","SMC","NSR","PrepMethod"]
["Poor","Dry","Lower Foothills","None"]
["Medium","Mesic","Upper Foothills","Drag"]
["Rich","Moist",null,"Mound"]

{"sheet":"Variables","index":3,"n_rows":357,"n_cols":6,"rows_kept":357,"cut":false,"hidden":true,"merged":[]}
["Name","Value","Source","Type","Input cell validation rules","Notes"]
["ageAWhand",{"$f":"IF(psAWhand=0,\" \",IF(Thin=TRUE,ageAWhandA,ageAWhandB))","v":14.677047999999999},"Calculated","Output (to GYPSY)",null,"Total age of AW at handover"]
["ageAWhandA",{"$f":"Submodels!C428","v":16.586030837132352},"Submodel 6B1","Internal"]
["ageAWhandB",{"$f":"Submodels!C427","v":14.677047999999999},"Submodel 6B1","Internal"]
["ageAWperf",{"$f":"IF(psAWperf=0,\" \",IF(ThinYetPerf=TRUE,ageAWperfA,ageAWperfB))","v":-2.3398099999999999},"Calculated","Internal",null,"Total age of AW at performance assessment"]
["ageAWperfOut",{"$f":"IF(ageAWperf<0,\" \",ageAWperf)","v":" "},"Calculated","Output",null,"Total age of AW at performance assessment"]
["ageAWperfA",{"$f":"Submodels!B428","v":1.4725126371323529},"Submodel 6B1","Internal"]
["ageAWperfB",{"$f":"Submodels!B427","v":-2.3398099999999999},"Submodel 6B1","Internal"]
["ageAWthinA",{"$f":"IF(Thin=TRUE,IF(psAWthinA=0,\" \",Submodels!D428),\" \")","v":" "},"Submodel 6B1","Internal",null,"Total age of AW in thin year, after thinning"]
["ageAWthinAout",{"$f":"IF(ageAWthinA<0,\" \",ageAWthinA)","v":" "},"Calculated","Output",null,"Total age of AW in thin year, after thinning"]
["ageAWthinB",{"$f":"IF(Thin=TRUE,IF(psAWb=0,\" \",Submodels!D427),\" \")","v":" "},"Submodel 6B1","Output",null,"Total age of AW in thin year, before thinning"]
["agePLhand",{"$f":"IF(denPLhand=0,\" \",IF(Plant=TRUE,GSGhand,IF(Thin=TRUE,agePLnHandA,agePLnHandB)))","v":18},"Calculated","Output (to GYPSY)",null,"Total age of PL at handover"]
["agePLnHandA",{"$f":"Submodels!C365","v":17.108324840824626},"Submodel 6A2","Internal"]
["agePLnHandB",{"$f":"Submodels!C353","v":16.633557375230087},"Submodel 6A1","Internal"]
["agePLperf",{"$f":"IF(denPLperf=0,\" \",IF(Plant=TRUE,GSGperf,IF(ThinYetPerf=TRUE,agePLnPerfA,agePLnPerfB)))","v":0},"Calculated","Output",null,"Total age of PL at performance assessment"]
["agePLnPerfA",{"$f":"Submodels!B365","v":0.96565841617601023},"Submodel 6A2","Internal"]
["agePLnPerfB",{"$f":"Submodels!B353","v":-0.25212440665708913},"Submodel 6A1","Internal"]
["agePLthinA",{"$f":"IF(Thin=TRUE,IF(denPLthinA=0,\" \",IF(Plant=TRUE,GSGthin,agePLnThinA)),\" \")","v":" "},"Calculated","Output",null,"Total age of PL in thin year, after thinning"]
["agePLthinB",{"$f":"IF(Thin=TRUE,IF(denPLthinB=0,\" \",IF(Plant=TRUE,GSGthin,agePLnThinB)),\" \")","v":" "},"Calculated","Output",null,"Total age of PL in thin year,before thinning"]
["agePLnThinA",{"$f":"Submodels!D365","v":2.8019772161760104},"Submodel 6A2","Internal"]
["agePLnThinB",{"$f":"Submodels!D353","v":1.6526201933429108},"Submodel 6A1","Internal"]
["ageSBhand",{"$f":"IF(OR(psSBhand=0,Thin=TRUE),\" \",Submodels!B470)","v":13.052356109459904},"Submodel 6C1","Output (to GYPSY)",null,"Total age of SB at handover"]
["ageSWhand",{"$f":"IF(OR(psSWhand=0,Thin=TRUE),\" \",Submodels!A491)","v":11.518197366550488},"Submodel 6C3","Output (to GYPSY)",null,"Total age of SW at handover"]
["baAW",{"$f":"IF(Thin=TRUE,baAWa,baAWb)","v":2.820191017362049E-2},"Calculated","Output (to GYPSY)",null,"Basal area per ha of AW at handover"]
["baAWa",{"$f":" PI()*(dbhAWa/2)^2*denAWhandA/10000","v":0.32335802342632658},"Calculated","Internal",null,"Basal area per ha aspen / poplar (1.3m) = PI()*(dbhAW/2)^2*denAW/10000"]
["baAWb",{"$f":" PI()*(dbhAWb/2)^2*denAWhandB/10000","v":2.820191017362049E-2},"Calculated","Internal"]
["baPL",{"$f":"IF(WGRadj=TRUE,baPLx,baPLnotX)","v":10.982059293254114},"Calculated","Output (to GYPSY)",null,"Basal area per ha of PL at handover"]
["baPLnotX",{"$f":"IF(Thin=TRUE,baPLa,baPLb)","v":10.982059293254114},"Calculated","Internal"]
["baPLa",{"$f":"SUM(baPLnA,baPLpA)","v":71.263058855535007},"Calculated","Internal"]
["baPLb",{"$f":"SUM(baPLnB,baPLpB)","v":10.982059293254114},"Calculated","Internal"]
["baPLx",{"$f":"IF(Thin=TRUE,baPLxA,baPLxB)","v":8.5777492114656315},"Calculated","Internal"]
["baPLxA",{"$f":"SUM(baPLnXa,baPLpXa)","v":54.236166960765431},"Calculated","Internal"]
["baPLxB",{"$f":"SUM(baPLnXb,baPLpXb)","v":8.5777492114656315},"Calculated","Internal"]
["baPLnA",{"$f":" PI()*(dbhPLnA/2)^2*denPLnHandA/10000","v":68.483764618256373},"Calculated","Internal",null,"Basal area per ha pine natural regeneration (1.3m)= PI()*(dbhPLn/2)^2*denPLn/10000"]
["baPLnB",{"$f":" PI()*(dbhPLnB/2)^2*denPLnHandB/10000","v":8.124941891965344},"Calculated","Internal"]
["baPLnXa",{"$f":" PI()*(dbhPLnXa/2)^2*denPLnHandXa/10000","v":51.878124015567764},"Calculated","Internal"]
["baPLnXb",{"$f":" PI()*(dbhPLnXb/2)^2*denPLnHandXb/10000","v":6.1548418875660769},"Calculated","Internal"]
["baPLpA",{"$f":"IF(denPLpHandA>0, PI()*(dbhPLpA/2)^2*denPLpHandA/10000,0)","v":2.7792942372786382},"Calculated","Internal",null,"Basal area per ha planted pine (1.3m)= PI()*(dbhPLp/2)^2*denPLp/10000"]
["baPLpB",{"$f":" IF(denPLpHandB>0,PI()*(dbhPLpB/2)^2*denPLpHandB/10000,0)","v":2.8571174012887699},"Calculated","Internal"]
["baPLpXa",{"$f":" IF(denPLpHandXa>0,PI()*(dbhPLpXa/2)^2*denPLpHandXa/10000,0)","v":2.3580429451976639},"Calculated","Internal"]
["baPLpXb",{"$f":"IF(denPLpHandXb>0, PI()*(dbhPLpXb/2)^2*denPLpHandXb/10000,0)","v":2.4229073238995542},"Calculated","Internal"]
["Cones",{"$f":"IF(ConesInc=TRUE,ConesInput,ConesDef)","v":3},"Calculated","Internal"]
["ConesInput",{"$f":"IF(InCones>10,10,InCones)","v":0},"Input (optional; required if ConesInc is TRUE)","Input","0 to 30","Ground cone density per m2 (pine only)"]
["ConesInc",false,"Input (required)","Input","TRUE / FALSE","Is cones optional input selected?"]
["ConesDef",3,"Calculated","Internal",null,"Default value for cones if optional input not selected (based on RLP modal value)"]
["ConesMiss",{"$f":"IF(AND(ConesInc=TRUE,InCones=\"\"),TRUE,FALSE)","v":false},"Calculated","Error","Stop error","Cones missing"]
["ConesOut",{"$f":"IF(ConesInc=TRUE,InCones,\"unknown\")","v":"unknown"},"Calculated","Output",null,"Ground cone density per m2 (pine only)"]
["dbhAW",{"$f":"IF(psAWhand=0,\" \",IF(Thin=TRUE,dbhAWa,dbhAWb))","v":2.3498286923370197},"Calculated","Internal",null,"Quadratic mean diameter breast-height of AW at handover"]
["dbhAWout",{"$f":"IF(dbhAW<0,\" \",dbhAW)","v":2.3498286923370197},"Calculated","Output",null,"Quadratic mean diameter breast-height of AW at handover"]
["dbhAWa",{"$f":"Submodels!C344","v":1.7177960447884795},"Submodel 5B2","Internal"]
["dbhAWb",{"$f":"Submodels!C338","v":2.3498286923370197},"Submodel 5B1","Internal"]
["dbhPL",{"$f":"IF(denPLhand=0,\" \",IF(WGRadj=TRUE,dbhPLx,dbhPLnotX))","v":5.201742892513388},"Calculated","Output",null,"Quadratic mean diameter breast-height of PL at handover"]
["dbhPLnotX",{"$f":"IF(Thin=TRUE,dbhPLa,dbhPLb)","v":5.201742892513388},"Calculated","Internal"]
["dbhPLa",{"$f":"SQRT(baPLa/denPLhandA*10000/PI())*2","v":15.061120859157239},"Calculated","Internal"]
["dbhPLb",{"$f":"SQRT(baPLb/denPLhandB*10000/PI())*2","v":5.201742892513388},"Calculated","Internal"]
["dbhPLx",{"$f":"IF(Thin=TRUE,dbhPLxA,dbhPLxB)","v":5.3468303832636606},"Calculated","Internal"]
["dbhPLxA",{"$f":"SQRT(baPLxA/denPLhandXa*10000/PI())*2","v":15.264419285332913},"Calculated","Internal"]
["dbhPLxB",{"$f":"SQRT(baPLxB/denPLhandXb*10000/PI())*2","v":5.3468303832636606},"Calculated","Internal"]
["dbhPLnA",{"$f":"Submodels!E324","v":15.311423317649721},"Submodel 5A4","Internal",null,"Quadratic mean diameter breast-height pine ingress at handover - thinned"]
["dbhPLnB",{"$f":"Submodels!E306","v":4.6008976809495579},"Submodel 5A3","Internal",null,"Quadratic mean diameter breast-height pine ingress at handover - not thinned"]
["dbhPLnXa",{"$f":"1.016237*dbhPLnA","v":15.560034898058401},"Calculated","Internal",null,"dbhPLn adjusted for exclusion of trees with more than 50% girdling of main stem by western gall rust"]
["dbhPLnXb",{"$f":"1.016237*dbhPLnB","v":4.6756024565951364},"Calculated","Internal"]
["dbhPLpA",{"$f":"Submodels!E293","v":11.228892957037148},"Submodel 5A2","Internal",null,"Quadratic mean diameter breast-height planted pine at handover - thinned"]
["dbhPLpB",{"$f":"Submodels!D285","v":11.385017997026361},"Submodel 5A1","Internal",null,"Quadratic mean diameter breast-height planted pine at handover - not thinned"]
["dbhPLpXa",{"$f":"0.197571+0.987841*dbhPLpA","v":11.289931847572532},"Calculated","Internal",null,"dbhPLp adjusted for exclusion of trees with more than 50% girdling of main stem by western gall rust"]
["dbhPLpXb",{"$f":"0.197571+0.987841*dbhPLpB","v":11.444158563200517},"Calculated","Internal"]
["denAWhand",{"$f":"IF(Thin=TRUE,denAWhandA,denAWhandB)","v":65.030372066602467},"Calculated","Output (to GYPSY)",null,"Density of AW at handover (trees per ha  1.3m+)"]
["denAWhandA",{"$f":"tpspAWa*psAWhandA*10","v":1395.2452839246635},"Calculated","Internal",null,"Stems per ha aspen / poplar (1.3m+) = tpspAW*psAW/100 *1000"]
["denAWhandA2000Less",{"$f":"IF(denAWhandA<2000,0,denAWhandA-2000)","v":0},"Calculated","Internal"]
["denAWhandB",{"$f":"tpspAWhandB*psAWb*10","v":65.030372066602467},"Calculated","Internal"]
["denAWperf",{"$f":"IF(ThinYetPerf=TRUE,denAWperfA,denAWperfB)","v":185.48544647802134},"Calculated","Output",null,"Density of AW at performance assessment (trees per ha  1.3m+)"]
["denAWperfA",{"$f":"tpspAWa*psAWperfA*10","v":{"$error":"#VALUE!"}},"Calculated","Internal"]
["denAWperfB",{"$f":"tpspAWperfB*psAWb*10","v":185.48544647802134},"Calculated","Internal"]
["denAWthinA",{"$f":"IF(Thin=TRUE,tpspAWa*psAWthinA*10,\" \")","v":" "},"Calculated","Output",null,"Density of AW after thinning (trees per ha 1.3m+)"]
["denAWthinB",{"$f":"IF(Thin=TRUE,tpspAWthinB*psAWb*10,\" \")","v":" "},"Calculated","Output",null,"Density of AW before thinning (trees per ha 1.3m+)"]
["denPLhand",{"$f":"IF(WGRadj=TRUE,denPLhandX,denPLhandNotX)","v":5167.6862479595493},"Calculated","Output (to GYPSY)",null,"Density of PL at handover (trees per ha  1.3m+)"]
["denPLhandNotX",{"$f":"IF(Thin=TRUE,denPLhandA,denPLhandB)","v":5167.6862479595493},"Calculated","Internal"]
["denPLhandA",{"$f":"SUM(denPLnHandA,denPLpHandA)","v":4000},"Calculated","Internal"]
["denPLhandB",{"$f":"SUM(denPLnHandB,denPLpHandB)","v":5167.6862479595493},"Calculated","Internal"]
["denPLhandX",{"$f":"IF(Thin=TRUE,denPLhandXa,denPLhandXb)","v":3820.2400098892017},"Calculated","Internal"]
["denPLhandXa",{"$f":"SUM(denPLnHandXa,denPLpHandXa)","v":2963.7293024621445},"Calculated","Internal"]
["denPLhandXb",{"$f":"SUM(denPLnHandXb,denPLpHandXb)","v":3820.2400098892017},"Calculated","Internal"]
["denPLnHandA",{"$f":"IF(PLnExc=TRUE,0,nTn)","v":3719.3463065636984},"Calculated","Internal",null,"Stems per ha pine ingress (1.3m+) at handover; thinned = nTn"]
["denPLnHandB",{"$f":"IF(PLnExc=TRUE,0,Submodels!E44)","v":4887.0325545232481},"Submodel 2A","Internal"]
["denPLnHandXa",{"$f":"0.733511*denPLnHandA","v":2728.1814286738449},"Calculated","Internal",null,"denPLnHand adjusted for exclusion of trees with more than 50% girdling of main stem by western gall rust"]
["denPLnHandXb",{"$f":"0.733511*denPLnHandB","v":3584.6921361009022},"Calculated","Internal"]
["denPLperf",{"$f":"IF(ThinYetPerf=TRUE,denPLperfA,denPLperfB)","v":8726.9392034302455},"Calculated","Output",null,"Density of PL at performance assessment (trees per ha  1.3m+)"]
["denPLperfA",{"$f":"SUM(denPLnPerfA,denPLpPerfA)","v":6083.3848151541242},"Calculated","Internal"]
["denPLperfB",{"$f":"SUM(denPLnPerfB,denPLpPerfB)","v":8726.9392034302455},"Calculated","Internal"]
["denPLnPerfA",{"$f":"IF(PLnExc=TRUE,0,Submodels!C70)","v":5775.0021988917506},"Submodel 2Ct","Internal"]
["denPLnPerfB",{"$f":"IF(PLnExc=TRUE,0,Submodels!C62)","v":8319.9188324559109},"Submodel 2Cnt","Internal"]
["denPLthinA",{"$f":"IF(Thin=TRUE,SUM(denPLnThinA,denPLpThinA),\" \")","v":" "},"Calculated","Output",null,"Density of PL after thinning (trees per ha 0.3m+)"]
["denPLthinB",{"$f":"IF(Thin=TRUE,SUM(denPLnThinB,denPLpThinB),\" \")","v":" "},"Calculated","Output",null,"Density of PL before thinning (trees per ha 0.3m+)"]
["denPLnThinA",{"$f":"IF(PLnExc=TRUE,0,Submodels!C70)","v":5775.0021988917506},"Submodel 2Ct","Internal"]
["denPLnThinB",{"$f":"IF(PLnExc=TRUE,0,Submodels!C62)","v":8319.9188324559109},"Submodel 2Cnt","Internal"]
["denPLpHandA",{"$f":"nTp","v":280.65369343630147},"Calculated","Internal",null,"Stems per ha planted pine (1.3m+) at handover; unthinned  = (1-(Mp/100*GSP))*nP; if thinned =nTp"]
["denPLpHandB",{"$f":"IF(Submodels!I11<0,0,Submodels!I11)","v":280.65369343630147},"Submodel 1A","Internal"]
["denPLpHandXa",{"$f":"0.839283*denPLpHandA","v":235.5478737882994},"Calculated","Internal"]
["denPLpHandXb",{"$f":"0.839283*denPLpHandB","v":235.5478737882994},"Calculated","Internal"]
["denPLpPerfA",{"$f":"IF(Submodels!G28<0,0,Submodels!G28)","v":308.38261626237352},"Submodel 1B","Internal"]
["denPLpPerfB",{"$f":"IF(Submodels!G11<0,0,Submodels!G11)","v":407.02037097433521},"Submodel 1A","Internal"]
["denPLpThinA",{"$f":"IF(Submodels!F28<0,0,Submodels!H28)","v":305.03398020533234},"Submodel 1B","Internal"]
["denPLpThinB",{"$f":"IF(Submodels!H11<0,0,Submodels!H11)","v":392.97962902566479},"Submodel 1A","Internal",null,"Stems per ha planted pine (30cm+) at thinning; unthinned = nP*(1-(mP/100*GSP)); thinned = nTp*1/(1-(mT/100*GST))"]
["denSB",{"$f":"IF(Thin=TRUE,\" \",tpspSB*psSBhand*10)","v":144.70370867837411},"Calculated","Output (to GYPSY)",null,"Density of SB at handover (trees per ha  1.3m+)"]
["denSW",{"$f":"IF(Thin=TRUE,\" \",tpspSW*psSWhand*10)","v":28.54518601787791},"Calculated","Output (to GYPSY)",null,"Density of SB at handover (trees per ha  1.3m+)"]
["Elev",{"$f":"InElev","v":1160},"Input (required)","Input","840 to 1621","Elevation above sea level"]
["ElevMiss",{"$f":"IF(InElev=\"\",TRUE,FALSE)","v":false},"Calculated","Error","Stop error","Elevation missing"]
["EsAW",false,"Calculated","Input",null,"Establishment survey conducted for AW (TRUE or FALSE)"]
["EsSB",false,"Calculated","Input",null,"Establishment survey conducted for SB (TRUE or FALSE)"]
["EsSW",false,"Calculated","Input",null,"Establishment survey conducted for SW (TRUE or FALSE)"]
["GSGhand",{"$f":"GSPhand+PstockAge","v":18},"Calculated","Internal",null,"Growing seasons since germination (PL planted stock)"]
["GSGperf",{"$f":"GSPperf+PstockAge","v":0},"Calculated","Internal"]
["GSGthin",{"$f":"GSPthin+PstockAge","v":2},"Calculated","Internal"]
["GSPhand",{"$f":"IF(Pearly=TRUE,YrHand-YrP+1,YrHand-YrP)","v":17},"Calculated","Internal",null,"Growing seasons since planting (PL planted stock) at handover"]
["GSPperf",{"$f":"IF(Pearly=TRUE,YrPerf-YrP+1,YrPerf-YrP)","v":-1},"Calculated","Internal",null,"Growing seasons since planting (PL planted stock) at performance assessment"]
["GSPthin",{"$f":"IF(Pearly=TRUE,YrThin-YrP+1,YrThin-YrP)","v":1},"Calculated","Internal",null,"Growing seasons since planting (PL planted stock) at thinning"]
["IncYieldSummary",true,"Calculated","Input","TRUE / FALSE","Include projected yield in summary report?"]
["IncGYPSY",true,"Calculated","Input","TRUE / FALSE","Generate detailed GYPSY output"]
["IntPerfHand",{"$f":"YSChand-YSCperf","v":18},"Calculated","Internal",null,"Years between performance and handover = YSChand-YSCperf; positive integer  (<7?) or 0"]
["IntThinHand",{"$f":"YSChand-YSCthin","v":16},"Calculated","Internal",null,"Years since thinning - between thinning and handover = YSChand-YSCthin"]
["IntThinPerf",{"$f":"YSCperf-YSCthin","v":-2},"Calculated","Internal",null,"Years since thiining - between thinning and performance (not applicable if performance assessment before thinning) =YSCperf-YSCthin"]
["Lat",{"$f":"InLat","v":53.5},"Input (required)","Input","51.50 to 54.80","Latitude in decimal degrees"]
["LatMiss",{"$f":"IF(InLat=\"\",TRUE,FALSE)","v":false},"Calculated","Error","Stop error","Latitude missing"]
["LFH",{"$f":"IF(LFHinc=TRUE,LFHinput,LFHdef)","v":30},"Calculated","Internal"]
["LFHinput",{"$f":"IF(InLFH<4,4,InLFH)","v":30},"Input (optional; required if LFHinc is TRUE)","Input","2 to 57","Depth of organic soil (litter, fungi, humus) cm, limited with minimum value"]
["LFHinc",true,"Input (required)","Input","TRUE / FALSE","Is LFH optional input selected?"]
["LFHdef",8.6999999999999993,"Calculated","Internal",null,"Default value for LFH if optional input not selected"]
["LFHmiss",{"$f":"IF(AND(LFHinc=TRUE,InLFH=\"\"),TRUE,FALSE)","v":false},"Calculated","Error","Stop error","LFH missing"]
["LFHout",{"$f":"IF(LFHinc=TRUE,InLFH,\"unknown\")","v":30},"Calculated","Output",null,"Depth of organic soil (litter, fungi, humus) cm"]
["LN1Cones",{"$f":"LN(Cones+1)","v":1.3862943611198906},"Calculated","Internal",null,"Natural logarithm of (Cones+1)"]
["LNdenPLpHandAless6",{"$f":"IF(LN(denPLpHandA)<6,0,LN(denPLpHandA)-6)","v":0},"Calculated","Internal",null,"Transformation for computing dbhPLpA"]
["LN1denPLnHandA",{"$f":"LN(denPLnHandA+1)","v":8.2215720360965765},"Calculated","Internal",null,"LN of (denPL+1)"]
["LN1denPLnHandB",{"$f":"LN(denPLnHandB+1)","v":8.4945451609199338},"Calculated","Internal"]
["LN1denPLnPerfA",{"$f":"LN(denPLnPerfA+1)","v":8.6614670612671443},"Calculated","Internal"]
["LN1denPLnPerfB",{"$f":"LN(denPLnPerfB+1)","v":9.0265279643108407},"Calculated","Internal"]
["LN1denPLnThinA",{"$f":"LN(denPLnThinA+1)","v":8.6614670612671443},"Calculated","Internal"]
["LN1denPLnThinB",{"$f":"LN(denPLnThinB+1)","v":9.0265279643108407},"Calculated","Internal"]
["LNnP",{"$f":"LN(nP)","v":5.9914645471079817},"Calculated","Internal"]
["LNtophtPLpHand",{"$f":"LN(tophtPLpHand)","v":6.545492693881986},"Calculated","Internal"]
["nP",{"$f":"IF(Plant=TRUE,nPinput,0)","v":400},"Calculated","Internal",null,"Number of PL planted per ha (set to zero if Plant=FALSE)"]
["nPinput",{"$f":"InNpInput","v":400},"Input (required if Plant=TRUE)","Input","800 to 4500","Number of PL planted per ha"]
["nPout",{"$f":"IF(Plant=TRUE,nP,\" \")","v":400},"Calculated","Output",null,"Number of PL planted per ha"]
["nPoutLabel",{"$f":"IF(Plant=TRUE,\"Density:\",\" \")","v":"Density:"},"Calculated","Output",null,"nP heading"]
["nPoutUnits",{"$f":"IF(Plant=TRUE,\"trees per ha\",\" \")","v":"trees per ha"},"Calculated","Output",null,"nP units for output"]
["nP750Less",{"$f":"IF(nP-750<0,0,nP-750)","v":0},"Calculated","Internal",null,"nP-750 (transformation used when no response shown below 750 stems per ha)"]
["nP1600Less",{"$f":"IF(nP-1600<0,0,nP-1600)","v":0},"Calculated","Internal",null,"nP-1600 (transformation used when no response shown below 1600 stems per ha)"]
["NSR",2,"Input (required)","Input","Pick list","Natural sub-region: 1=LF, 2= UF"]
["NSRout",{"$f":"IF(NSR=1,\"LF\",\"UF\")","v":"UF"},"Calculated","Output",null,"Natural sub-region: 1=LF, 2= UF"]
["nT",{"$f":"InNt","v":4000},"Input (required if THIN=TRUE)","Input","500 to 5000","Target post-thinning density of lodegpole pine at handover (trees per ha 1.3m+)"]
["nTwarning",{"$f":"IF(ThinInput=FALSE,\"Thinning target not required\",IF(AND(InNt=0,ThinInput=FALSE),\" \",IF(ThinInput=FALSE,\"Thinning target not required\",IF(InNt=0,\"Error: thinning target missing\",IF(InNt>denPLhandB,\"Warning: thinning target exceeds number of available trees\",\"Thinning target OK\")))))","v":"Thinning target not required"},"Calculated","Error and warning","Stop error","Warning if thinning target missing or exceeds number of available trees at handover"]
["nTout",{"$f":"IF(Thin=TRUE,nT,\" \")","v":" "},"Calculated","Output",null,"Target post-thinning density of lodegpole pine at handover (trees per ha 1.3m+)"]
["nToutUnits",{"$f":"IF(Thin=TRUE,\"trees per ha at handover\",\" \")","v":" "},"Calculated","Output",null,"Target units"]
["nToutLabel",{"$f":"IF(ThinInput=FALSE,\" \",IF(Thin=TRUE,\"Target density:\",\"THINNING CANCELLED!\"))","v":" "},"Calculated","Output",null,"Target label"]
["nTn",{"$f":"IF(denPLnHandB<(nT-nTp),denPLnHandB,(nT-nTp))","v":3719.3463065636984},"Calculated","Internal",null,"Target post-thinning density of natural lodegpole pine at handover (trees per ha 1.3m+)"]
["nTp",{"$f":"IF(denPLpHandB<nT,denPLpHandB,nT)","v":280.65369343630147},"Calculated","Internal",null,"Target post-thinning density of WGR-free planted PL at handover (trees per ha 1.3m+)"]
["MaxBaPL",{"$f":"IF(SNC=1,18.5,26.8)","v":26.8},"Calculated","Internal",null,"Maximum basal area of PL at handover (97.5 percentile)"]
["MaxBaPLcheck",{"$f":"IF(baPL>MaxBaPL,\"X\",\"OK\")","v":"OK"},"Calculated","Internal check",null,"Maximum basal area of PL at handover (97.5 percentile)"]
["MaxDbhDenPLnA",{"$f":"(EXP(5.8392126-0.4545962*LN(denPLhandA)))","v":7.9150748577746404},"Calculated","Internal",null,"Maximum handover Dbh for PL ingress at denPLhandA"]
["MaxDbhDenPLnAcheck",{"$f":"IF(dbhPLnA>MaxDbhDenPLnA,\"X\",\"OK\")","v":"X"},"Calculated","Internal check",null,"Maximum handover Dbh for PL ingress at denPLhandA"]
["MaxDbhDenPLpA",{"$f":"EXP(4.5923903-0.2859742*LN(denPLpHandA))","v":19.694097829262351},"Calculated","Internal",null,"Maximum handover Dbh for planted PL ingress at denPLpHandA"]
["MaxDbhDenPLpAcheck",{"$f":"IF(dbhPLpA>MaxDbhDenPLpA,\"X\",\"OK\")","v":"OK"},"Calculated","Internal check",null,"Maximum handover Dbh for planted PL ingress at denPLpHandA"]
["MaxDbhDenPLnB",{"$f":"(EXP(5.8392126-0.4545962*LN(denPLhandB)))","v":7.0451054356532961},"Calculated","Internal",null,"Maximum handover Dbh for PL ingress at denPLhandB"]
["MaxDbhDenPLnBcheck",{"$f":"IF(dbhPLnB>MaxDbhDenPLnB,\"X\",\"OK\")","v":"OK"},"Calculated","Internal check",null,"Maximum handover Dbh for PL ingress at denPLhandB"]
["MaxDbhDenPLpB",{"$f":"EXP(4.5923903-0.2859742*LN(denPLpHandB))","v":19.694097829262351},"Calculated","Internal",null,"Maximum handover Dbh for planted PL ingress at denPLpHandB"]
["MaxDbhDenPLpBcheck",{"$f":"IF(dbhPLpB>MaxDbhDenPLpB,\"X\",\"OK\")","v":"OK"},"Calculated","Internal check",null,"Maximum handover Dbh for planted PL ingress at denPLpHandB"]
["MaxDbhPLnA",{"$f":"IF(SNC=1,6.75,10.88)","v":10.88},"Calculated","Internal",null,"Maximum DBH for PL ingress at handover (97.5 percentile)"]
["MaxDbhPLnAcheck",{"$f":"IF(dbhPLnA>MaxDbhPLnA,\"X\",\"OK\")","v":"X"},"Calculated","Internal check",null,"Maximum DBH for PL ingress at handover (97.5 percentile)"]
["MaxDbhPLpA",{"$f":"IF(SNC=1,10.93,IF(SNC=2,13.22,15.19))","v":13.22},"Calculated","Internal",null,"Maximum DBH for planted PL at handover (97.5 percentile)"]
["MaxDbhPLpAcheck",{"$f":"IF(dbhPLpA>MaxDbhPLpA,\"X\",\"OK\")","v":"OK"},"Calculated","Internal check",null,"Maximum DBH for planted PL at handover (97.5 percentile)"]
["MaxDbhPLnB",{"$f":"IF(SNC=1,6.75,10.88)","v":10.88},"Calculated","Internal",null,"Maximum DBH for PL ingress at handover (97.5 percentile)"]
["MaxDbhPLnBcheck",{"$f":"IF(dbhPLnB>MaxDbhPLnB,\"X\",\"OK\")","v":"OK"},"Calculated","Internal check",null,"Maximum DBH for PL ingress at handover (97.5 percentile)"]
["MaxDbhPLpB",{"$f":"IF(SNC=1,10.93,IF(SNC=2,13.22,15.19))","v":13.22},"Calculated","Internal",null,"Maximum DBH for planted PL at handover (97.5 percentile)"]
["MaxDbhPLpBcheck",{"$f":"IF(dbhPLpB>MaxDbhPLpB,\"X\",\"OK\")","v":"OK"},"Calculated","Internal check",null,"Maximum DBH for planted PL at handover (97.5 percentile)"]
["MaxDenPLn",{"$f":"IF(SNC=1,16198,IF(SNC=2,23248,5300))","v":23248},"Calculated","Internal",null,"Maximum density for PL ingress at handover (97.5 percentile)"]
["MaxDenPLnCheck",{"$f":"IF(denPLnHandB>MaxDenPLn,\"X\",\"OK\")","v":"OK"},"Calculated","Internal check",null,"Maximum density for PL ingress at handover (97.5 percentile)"]
["MaxSD",7.5000000000000002E-4,"Set","Internal",null,"Maximum ratio of stocking probability (S) to density - changed from 1 (theoretical) to 0.00075 (EPH data)"]
["MaxSpinAWweed",0.55000000000000004,"Calculated","Internal",null,"This is the maximum value of spinAW used for estimating weeded AW trees per stocked plot in sub-model 4A6"]
["MaxSpinAWweedCheck",{"$f":"IF(spinAW>MaxSpinAWweed,\"X\",\"OK\")","v":"OK"},"Calculated","Internal check",null,"This is the maximum value of spinAW used for estimating AW trees per ha in weeded stands (based on EPH data)"]
["MaxTophtPLn",{"$f":"IF(SNC=1,702.1,IF(SNC=2,907.2,992.4))","v":907.2},"Calculated","Internal",null,"Maximum PL top ht at handover (97.5 percentile) in LFN stands"]
["MaxTophtPLnCheck",{"$f":"IF(tophtPLnHandB>MaxTophtPLn,\"X\",\"OK\")","v":"OK"},"Calculated","Internal check",null,"Maximum PL top ht at handover (97.5 percentile) in LFN stands"]
["MaxTophtPLp",{"$f":"IF(SNC=1,702.1,IF(SNC=2,907.2,992.4))","v":907.2},"Calculated","Internal",null,"Maximum PL top ht at handover (97.5 percentile) in planted stands"]
["MaxTophtPLpCheck",{"$f":"IF(tophtPLpHand>MaxTophtPLn,\"X\",\"OK\")","v":"OK"},"Calculated","Internal check",null,"Maximum PL top ht at handover (97.5 percentile) in planted stands"]
["Pearly",false,"Input (required if Plant=TRUE)","Input","TRUE / FALSE","Plant early (TRUE only if full growing season expected in same year)"]
["PearlyOut",{"$f":"IF(AND(Plant=TRUE,Pearly=TRUE),\"(advanced)\",\" \")","v":" "},"Calculated","Output",null,"Plant early (TRUE only if full growing season expected in same year)"]
["Plant",true,"Input (required)","Input","TRUE / FALSE","Plant at specified nP level (TRUE), or leave for natural (FALSE)"]
["PlantDataWarning",{"$f":"IF(Plant=FALSE,\"Planting density not required \",IF(InNpInput=0,\"Error: planting density missing\",\"Planting density OK\"))","v":"Planting density OK"},"Calculated","Error","Stop error","Warning if planting density needed and missing"]
["PLnExc",{"$f":"IF(OR(Cones=0,PLnExcInput=TRUE),TRUE,FALSE)","v":false},"Calculated","Internal",null,"Exclude all PL natural regeneration - models input (also assumed if Cones = 0)"]
["PLnExcInput",false,"Input (required)","Input","TRUE / FALSE","Exclude all PL natural regeneration - user input"]
["PLnExcNote",{"$f":"IF(PLnExc=TRUE,\"(PL ingress excluded)\",\"(PL ingress included)\")","v":"(PL ingress included)"},"Calculated","Output",null,"Pine ingress excluded from all computations and report"]
["PLnExcOut",{"$f":"IF(PLnExc=TRUE,\"PL ingress excluded from all projections\",\"PL ingress included in all projections\")","v":"PL ingress included in all projections"},"Calculated","Output",null,"Pine ingress excluded from all computations and report"]
["Prep",2,"Input (required)","Input","Pick list","Mechanical site preparation: 1=None, 2=Drag,  3=Mound"]
["PrepOut",{"$f":"IF(Prep=2,\"Drag scarification\",IF(Prep=3,\"Mounding\",\" \"))","v":"Drag scarification"},"Calculated","Output",null,"Mechanical site preparation: 1=None, 2=Drag,  3=Mound"]
["PrepB",{"$f":"IF(Prep=1,\"None\",\"MSP\")","v":"MSP"},"Calculated","Internal",null,"Broad mechanical site prep (2 levels): none, MSP"]
["psAWes",{"$f":"InPsAWes","v":0},"Input (required if EsAW=TRUE)","Input","0 to 100","Percent stocking of AW at establishment survey (trees 1.3m+)"]
["psAWesMiss",{"$f":"IF(AND(EsAW=TRUE,InPsAWes=\"\"),TRUE,FALSE)","v":false},"Calculated","Error","Stop error","psAWes is required and missing"]
["psAWesOut",{"$f":"IF(EsAW=TRUE,psAWes,\"unknown\")","v":"unknown"},"Calculated","Output",null,"Percent stocking of AW at establishment survey (trees 1.3m+)"]
["psAWhand",{"$f":"IF(Thin=TRUE,psAWhandA,psAWb)","v":5.0171439792905419},"Calculated","Output (to GYPSY)",null,"Percent stocking of AW at handover (trees 1.3m+)"]
["psAWperf",{"$f":"IF(ThinYetPerf=TRUE,psAWperfA,psAWb)","v":5.0171439792905419},"Calculated","Output",null,"Percent stocking of AW at performance assessment (trees 1.3m+)"]
["psAWhandA",{"$f":"Submodels!O153","v":91.761713525533622},"Submodel 4A4","Internal"]
["psAWperfA",{"$f":"Submodels!E153","v":{"$error":"#VALUE!"}},"Submodel 4A4","Internal"]
["psAWthinA",{"$f":"IF(Thin=TRUE,Submodels!J153,\" \")","v":" "},"Submodel 4A4","Output",null,"Percent stocking of AW at thin year, before thinning (trees 1.3m+)"]
["psAWthinB",{"$f":"IF(Thin=TRUE,psAWb,\" \")","v":" "},"Calculated","Output",null,"Percent stocking of AW at thin year, after thinning (trees 1.3m+)"]
["psAWb",{"$f":"IF(Weed=FALSE,Submodels!D136,Submodels!C146)","v":5.0171439792905419},"Submodels 4A3","Internal",null,"Percent stocking of unthinned aspen (at performance, thin and handover, trees 1.3m+)"]
["psPLhand",{"$f":"IF(denPLhand=0,0,IF(WGRadj=TRUE,psPLhandX,psPLhandNotX))","v":84.510732899765955},"Calculated","Output (to GYPSY)",null,"Percent stocking of PL at handover (trees 1.3m+)"]
["psPLhandNotX",{"$f":"IF(Thin=TRUE,psPLhandA,psPLhandB)","v":84.510732899765955},"Calculated","Internal"]
["psPLhandA",{"$f":"IF(Plant=TRUE,psPLplantHandA,psPLlfnHandA)","v":88.29251930480865},"Calculated","Internal"]
["psPLhandB",{"$f":"IF(Plant=TRUE,psPLplantHandB,psPLlfnHandB)","v":84.510732899765955},"Calculated","Internal"]
["psPLperf",{"$f":"IF(denPLperf=0,0,IF(ThinYetPerf=TRUE,psPLperfA,psPLperfB))","v":89.815683068988008},"Calculated","Output",null,"Percent stocking of PL at performance assessment (trees 0.3m+)"]
["psPLperfA",{"$f":"IF(Plant=TRUE,psPLplantPerfA,psPLlfnPerfA)","v":87.96974803896515},"Calculated","Internal"]
["psPLperfB",{"$f":"IF(Plant=TRUE,psPLplantPerfB,psPLlfnPerfB)","v":89.815683068988008},"Calculated","Internal"]
["psPLthinA",{"$f":"IF(Thin=TRUE,IF(denPLthinA=0,0,IF(Plant=TRUE,psPLplantThinA,psPLlfnThinA)),\" \")","v":" "},"Calculated","Output",null,"Percent stocking of PL in thin year, after thinning (trees 0.3m+)"]
["psPLthinB",{"$f":"IF(Thin=TRUE,IF(denPLthinB=0,0,IF(Plant=TRUE,psPLplantThinB,psPLlfnThinB)),\" \")","v":" "},"Calculated","Output",null,"Percent stocking of PL in thin year, before thinning (trees 0.3m+)"]
["psPLhandX",{"$f":"IF(Thin=TRUE,psPLhandXa,psPLhandXb)","v":76.394443707768119},"Calculated","Internal"]
["psPLhandXa",{"$f":"IF(Plant=TRUE,psPLplantHandXa,psPLlfnHandXa)","v":82.906342645047772},"Calculated","Internal"]
["psPLhandXb",{"$f":"IF(Plant=TRUE,psPLplantHandXb,psPLlfnHandXb)","v":76.394443707768119},"Calculated","Internal"]
["psPLadj",0.97,"Set","Internal",null,"Adjustment factor for psPL"]
["psPLplantHandA",{"$f":"Submodels!D80*psPLadj","v":88.29251930480865},"Submodel 3A","Internal",null,"Adjustment factor applied"]
["psPLplantHandB",{"$f":"Submodels!D81*psPLadj","v":84.510732899765955},"Submodel 3A","Internal",null,"Adjustment factor applied"]
["psPLplantHandXa",{"$f":"Submodels!G80*psPLadj","v":82.906342645047772},"Submodel 3A","Internal",null,"Adjustment factor applied"]
["psPLplantHandXb",{"$f":"Submodels!G81*psPLadj","v":76.394443707768119},"Submodel 3A","Internal",null,"Adjustment factor applied"]
["psPLlfnHandA",{"$f":"Submodels!D89","v":91.746992877767696},"Submodel 3B","Internal",null,"Adjustment factor applied"]
["psPLlfnHandB",{"$f":"Submodels!D90*psPLadj","v":90.1553993023945},"Submodel 3B","Internal",null,"Adjustment factor applied"]
["psPLlfnHandXa",{"$f":"Submodels!G89*psPLadj","v":80.95717826917361},"Submodel 3B","Internal",null,"Adjustment factor applied"]
["psPLlfnHandXb",{"$f":"Submodels!G90*psPLadj","v":81.66835672449136},"Submodel 3B","Internal",null,"Adjustment factor applied"]
["psPLplantPerfA",{"$f":"Submodels!D99*psPLadj","v":87.96974803896515},"Submodel 3C","Internal",null,"Adjustment factor applied"]
["psPLplantPerfB",{"$f":"Submodels!D100*psPLadj","v":89.815683068988008},"Submodel 3C","Internal",null,"Adjustment factor applied"]
["psPLplantThinA",{"$f":"Submodels!G99*psPLadj","v":{"$error":"#VALUE!"}},"Submodel 3C","Internal",null,"Adjustment factor applied"]
["psPLplantThinB",{"$f":"Submodels!G100*psPLadj","v":{"$error":"#VALUE!"}},"Submodel 3C","Internal",null,"Adjustment factor applied"]
["psPLlfnPerfA",{"$f":"Submodels!D108*psPLadj","v":89.364792682277695},"Submodel 3D","Internal",null,"Adjustment factor applied"]
["psPLlfnPerfB",{"$f":"Submodels!D109*psPLadj","v":92.128310365251082},"Submodel 3D","Internal",null,"Adjustment factor applied"]
["psPLlfnThinA",{"$f":"Submodels!G108*psPLadj","v":{"$error":"#VALUE!"}},"Submodel 3D","Internal",null,"Adjustment factor applied"]
["psPLlfnThinB",{"$f":"Submodels!G109*psPLadj","v":{"$error":"#VALUE!"}},"Submodel 3D","Internal",null,"Adjustment factor applied"]
["psSBes",{"$f":"InPsSBes","v":0},"Input (required if EsSB=TRUE)","Input","0 to 100","Percent stocking of SB (trees 0.3m+) at establishment survey"]
["psSBesMiss",{"$f":"IF(AND(EsSB=TRUE,InPsSBes=\"\"),TRUE,FALSE)","v":false},"Calculated","Error","Stop error","psSBes is required and missing"]
["psSBesOut",{"$f":"IF(EsSB=TRUE,psSBes,\"unknown\")","v":"unknown"},"Calculated","Output",null,"Percent stocking of SB (trees 0.3m+) at establishment survey"]
["psSBhand",{"$f":"IF(Thin=TRUE,\" \",IF(EsSB=TRUE,Submodels!F246,Submodels!F231))","v":11.034868883442488},"Submodels 4B3, 4B4","Output (to GYPSY)",null,"Percent stocking of SB (trees 1.3m+) at handover"]
["psSWes",{"$f":"InPsSWes","v":0},"Input (required if EsSW=TRUE)","Input","0 to 100","Percent stocking of SB (trees 0.3m+) at establishment survey"]
["psSWesMiss",{"$f":"IF(AND(EsSW=TRUE,InPsSWes=\"\"),TRUE,FALSE)","v":false},"Calculated","Error","Stop error","psSWes is required and missing"]
["psSWesOut",{"$f":"IF(EsSW=TRUE,psSWes,\"unknown\")","v":"unknown"},"Calculated","Output",null,"Percent stocking of SB (trees 0.3m+) at establishment survey"]
["psSWhand",{"$f":"IF(Thin=TRUE,\" \",Submodels!F260)","v":2.8545186017877908},"Submodel 4B5","Output (to GYPSY)",null,"Percent stocking of SW (trees 1.3m+) at handover"]
["PstockAge",1,"Set","Internal",null,"Planting stock age (years) - set to default of 1"]
["Slope ",{"$f":"IF(SlopeInc=TRUE,SlopeInput,SlopeDef)","v":4},"Calculated","Internal",null,"Slope percent"]
["SlopeInput",{"$f":"IF(InSlope<3,3,InSlope)","v":3},"Input (optional; required if SlopeInc is TRUE)","Input","0 to 23","Slope %"]
["SlopeInc",false,"Input (required)","Input","TRUE / FALSE","Is optional slope input selected?"]
["SlopeDef",4,"Calculated","Internal",null,"Default value for Slope if optional input not selected"]
["SlopeMiss",{"$f":"IF(AND(SlopeInc=TRUE,InSlope=\"\"),TRUE,FALSE)","v":false},"Calculated","Error","Stop error","Slope missing"]
["SlopeOut",{"$f":"IF(SlopeInc=TRUE,InSlope,\"unknown\")","v":"unknown"},"Calculated","Output",null,"Slope %"]
["SMC",2,"Input (required)","Input","Pick list","Soil moisture class: 1=Dry, 2=Mesic, 3=Moist"]
["SMCout",{"$f":"IF(SMC=1,\"dry\",IF(SMC=3,\"moist\",\"mesic\"))","v":"mesic"},"Calculated","Output",null,"Soil moisture class: 1=Dry, 2=Mesic, 3=Moist"]
["SMCb",{"$f":"IF(SMC=3,\"Moist\",\"MesicDry\")","v":"MesicDry"},"Calculated","Internal",null,"Broad soil moisture class (2 levels): MesicDry, Moist (used when no significanr response difference between mesic and dry levels)"]
["SMCc",{"$f":"IF(SMC=1,\"Dry\",\"MesicMoist\")","v":"MesicMoist"},"Calculated","Internal",null,"Broad soil moisture class (2 levels): Dry, MesicMoist (used when no significant difference difference between mesic and moist levels)"]
["SNC",2,"Input (required)","Input","Pick list","Soil nutrient class: 1=B (Poor), 2=C (Medium), 3=D (Rich)"]
["SNCout",{"$f":"IF(SNC=1,\"poor\",IF(SNC=3,\"rich\",\"medium\"))","v":"medium"},"Calculated","Output",null,"Soil nutrient class: 1=B (Poor), 2=C (Medium), 3=D (Rich)"]
["SNCb",{"$f":"IF(SNC=1,\"B\",\"CD\")","v":"CD"},"Calculated","Internal",null,"Broad soil nutrient class (2 levels): B, CD (used when significant diference between C and D)"]
["SNCd",{"$f":"IF(SNC=3,\"D\",\"BC\")","v":"BC"},"Calculated","Internal",null,"Broad soil nutrient class (2 levels): D, BC (used when no significant difference between B and C)"]
["spinAW",{"$f":"IF(EsAW=TRUE,psAWes/100,IF(Weed=TRUE,Submodels!C124,Submodels!C117))","v":2.389705882352941E-2},"Calculated or Submodels 4A1, 4A2","Internal"]
["spinAW125Less",{"$f":"IF(spinAW-0.125<0,0,spinAW-0.125)","v":0},"Calculated","Internal"]
["spinAW8125Less",{"$f":"IF(spinAW-0.8125<0,0,spinAW-0.8125)","v":0},"Calculated","Internal"]
["spinAWweed",{"$f":"IF(spinAW>MaxSpinAWweed,MaxSpinAWweed,spinAW)","v":2.389705882352941E-2},"Calculated","Internal"]
["spinSB",{"$f":"IF(EsSB=TRUE,psSBes/100,Submodels!F191)","v":5.6054544429132873E-2},"Calculated or Submodel 4B1","Internal"]
["spinSW",{"$f":"IF(EsSW=TRUE,psSWes/100,Submodels!F213)","v":1.1861048646757598E-2},"Calculated or Submodel 4B2","Internal"]
["SQRTdenPLnHandA",{"$f":"SQRT(denPLnHandA)","v":60.986443629414055},"Calculated","Internal"]
["SQRTdenPLnHandB",{"$f":"SQRT(denPLnHandB)","v":69.907314027383777},"Calculated","Internal"]
["SQRTdenPLnHandXa",{"$f":"SQRT(denPLnHandXa)","v":52.231996215670762},"Calculated","Internal"]
["SQRTdenPLnHandXb",{"$f":"SQRT(denPLnHandXb)","v":59.87229857038146},"Calculated","Internal"]
["SQRTdenPLnPerfA",{"$f":"SQRT(denPLnPerfA)","v":75.993435235497486},"Calculated","Internal"]
["SQRTdenPLnPerfB",{"$f":"SQRT(denPLnPerfB)","v":91.213589077811818},"Calculated","Internal"]
["SQRTdenPLnThinA",{"$f":"SQRT(denPLnThinA)","v":75.993435235497486},"Calculated","Internal"]
["SQRTdenPLnThinB",{"$f":"SQRT(denPLnThinB)","v":91.213589077811818},"Calculated","Internal"]
["SQRTdenPLpHandA",{"$f":"SQRT(denPLpHandA)","v":16.752721970960465},"Calculated","Internal"]
["SQRTdenPLpHandB",{"$f":"SQRT(denPLpHandB)","v":16.752721970960465},"Calculated","Internal"]
["SQRTdenPLpHandXa",{"$f":"SQRT(denPLpHandXa)","v":15.347568986269435},"Calculated","Internal"]
["SQRTdenPLpHandXb",{"$f":"SQRT(denPLpHandXb)","v":15.347568986269435},"Calculated","Internal"]
["SQRTdenPLpPerfA",{"$f":"SQRT(denPLpPerfA)","v":17.5608261839349},"Calculated","Internal"]
["SQRTdenPLpPerfB",{"$f":"SQRT(denPLpPerfB)","v":20.174745871369364},"Calculated","Internal"]
["SQRTdenPLpThinA",{"$f":"SQRT(denPLpThinA)","v":17.465222019926696},"Calculated","Internal"]
["SQRTdenPLpThinB",{"$f":"SQRT(denPLpThinB)","v":19.823713805078622},"Calculated","Internal"]
["StandId",{"$f":"InStandId","v":"Example 1"},"Input (required)","Input","Not blank","Stand identifier"]
["StandMiss",{"$f":"IF(InStandId=\"\",TRUE,FALSE)","v":false},"Calculated","Error","Stop error","StandId missing"]
["StandErrorWarning",{"$f":"IF(OR(StandMiss=TRUE,ElevMiss=TRUE,LatMiss=TRUE,LFHmiss=TRUE,SlopeMiss=TRUE,ConesMiss=TRUE,psAWesMiss=TRUE,psSBesMiss=TRUE,psSWesMiss=TRUE),\"Inputs for stand and site factors incomplete\",\"Inputs for stand and site factors OK\")","v":"Inputs for stand and site factors OK"},"Calculated","Error","Stop error","Indicates when some required stand and site inputs are missing"]
["Thin",{"$f":"IF(denPLhandB<nT,FALSE,ThinInput)","v":false},"Calculated","Internal",null,"Thin target acceptable: FALSE if target > denPLhandB"]
["ThinInput",false,"Input (required)","Input","TRUE / FALSE","Thin target given: TRUE or FALSE"]
["ThinPerfNote",{"$f":"IF(AND(Thin=TRUE,YrThin=YrPerf),\"(before thinning)\",\" \")","v":" "},"Calculated","Output",null,"Indicates that performance assessment preceded thinning when both events are in same year"]
["ThinYetPerf",{"$f":"IF(Thin=TRUE,IF(IntThinPerf>0,TRUE,FALSE))","v":false},"Calculated","Internal"]
["tophtAWhand",{"$f":"IF(psAWhand=0,\" \",IF(Thin=TRUE,tophtAWhandA,tophtAWhandB))","v":470.73957215949525},"Calculated","Internal",null,"Top height of AW at handover"]
["tophtAWhandOut",{"$f":"IF(psAWhand=0,\" \",IF(Thin=TRUE,tophtAWhandA,tophtAWhandB)/100)","v":4.7073957215949527},"Calculated","Output (to GYPSY)",null,"Top height of AW at handover (cm converted to m in report)"]
["tophtAWhandA",{"$f":"Submodels!E448","v":595.37633955848651},"Submodel 6B2a","Internal"]
["tophtAWhandB",{"$f":"Submodels!E458","v":470.73957215949525},"Submodel 6B2b","Internal"]
["tophtAWperf",{"$f":"IF(psAWperf=0,\" \",IF(ThinYetPerf=TRUE,tophtAWperfA,tophtAWperfB)/100)","v":0.58002403055483631},"Calculated","Output",null,"Top height of AW at performance assesment (cm converted to m in report)"]
["tophtAWperfA",{"$f":"Submodels!D448","v":92.718450474341154},"Submodel 6B2a","Internal"]
["tophtAWperfB",{"$f":"Submodels!D458","v":58.002403055483633},"Submodel 6B2b","Internal"]
["tophtAWthinA",{"$f":"IF(Thin=TRUE,IF(psAWthinA=0,\" \",Submodels!G448/100),\" \")","v":" "},"Submodel 6B2a","Output",null,"Top height of AW after thinning (cm converted to m in report)"]
["tophtAWthinB",{"$f":"IF(Thin=TRUE,IF(psAWb=0,\" \",Submodels!G458/100),\" \")","v":" "},"Submodel 6B2b","Output",null,"Top height of AW before thinning (cm converted to m in report)"]
["tophtPLadj",{"$f":"IF(SNC=1,0.9,IF(SNC=2,1,1))","v":1},"Calculated","Internal",null,"Top height adjustment for PL based on EPH and SSPT data"]
["pDelay",{"$f":"19-GSGhand","v":1},"Calculated","Internal",null,"Planting delay - used in top height adjustment"]
["tophtPLpAdj",{"$f":"IF(SNC=1,1,1-(pDelay*0.01))","v":0.99},"Calculated","Internal",null,"Adjustment to compensate for projected SI increasing with planting delay"]
["tophtPLhand",{"$f":"IF(denPLhand=0,\" \",IF(Plant=TRUE,tophtPLpHand,IF(Thin=TRUE,tophtPLnHandA,tophtPLnHandB)))","v":696.09955846903688},"Calculated","Internal",null,"Top height of PL at handover"]
["tophtPLhandOut",{"$f":"IF(denPLhand=0,\" \",IF(Plant=TRUE,tophtPLpHand,IF(Thin=TRUE,tophtPLnHandA,tophtPLnHandB))/100)","v":6.9609955846903686},"Calculated","Output (to GYPSY)",null,"Top height of PL at handover (cm converted to m in report)"]
["tophtPLnHandA",{"$f":"Submodels!E379","v":635.65610682873978},"Submodel 6A3a","Internal",null,"Note: requires agePLn, which is missing and assumed 0 if planting option selected"]
["tophtPLnHandB",{"$f":"Submodels!E396","v":614.34577412899773},"Submodel 6A3b","Internal"]
["tophtPLperf",{"$f":"IF(denPLperf=0,\" \",IF(Plant=TRUE,tophtPLpPerf,IF(ThinYetPerf=TRUE,tophtPLnPerfA,tophtPLnPerfB))/100)","v":-1.3233062587096325},"Calculated","Output",null,"Top height of PL at performance assesment (cm converted to m in report)"]
["tophtPLnPerfA",{"$f":"Submodels!D379","v":-88.920906340078659},"Submodel 6A3a","Internal"]
["tophtPLnPerfB",{"$f":"Submodels!D396","v":-143.58210153825092},"Submodel 6A3b","Internal"]
["tophtPLthinA",{"$f":"IF(Thin=TRUE,IF(denPLthinA=0,\" \",IF(Plant=TRUE,tophtPLpThin,tophtPLnThinA)/100),\" \")","v":" "},"Calculated","Output",null,"Top height of PL after thinning (cm converted to m in report)"]
["tophtPLthinB",{"$f":"IF(Thin=TRUE,IF(denPLthinB=0,\" \",IF(Plant=TRUE,tophtPLpThin,tophtPLnThinB)/100),\" \")","v":" "},"Calculated","Output",null,"Top height of PL before thinning (cm converted to m in report)"]
["tophtPLnThinA",{"$f":"Submodels!F379","v":-6.4962091848370953},"Submodel 6A3a","Internal"]
["tophtPLnThinB",{"$f":"Submodels!F396","v":-58.086055419743744},"Submodel 6A3b","Internal"]
["tophtPLpHand",{"$f":"Submodels!E414","v":696.09955846903688},"Submodel 6A4","Internal"]
["tophtPLpPerf",{"$f":"Submodels!D414","v":-132.33062587096325},"Submodel 6A4","Internal"]
["tophtPLpThin",{"$f":"Submodels!F414","v":-40.282827610963217},"Submodel 6A4","Internal"]
["tophtSB",{"$f":"IF(OR(psSBhand=0,Thin=TRUE),\" \",Submodels!C481/100)","v":2.4509417377259188},"Submodel 6C2","Output (to GYPSY)",null,"Top height of SB at handover - cannot be less than 0.30"]
["tophtSW",{"$f":"IF(OR(psSWhand=0,Thin=TRUE),\" \",Submodels!A501/100)","v":2.2349535670063823},"Submodel 6C4","Output (to GYPSY)",null,"Top height of SW at handover"]
["tpspAWa",{"$f":"Submodels!C178","v":1.5205091865862144},"Submodel 4A7","Internal"]
["tpspAWhandB",{"$f":"IF(Weed=TRUE,Submodels!D171,Submodels!E162)","v":1.2961631624492109},"Submodel 4A5,4A6","Internal"]
["tpspAWperfB",{"$f":"IF(Weed=TRUE,Submodels!B171,Submodels!C162)","v":3.697032559632667},"Submodel 4A5,4A6","Internal"]
["tpspAWthinB",{"$f":"IF(Weed=TRUE,Submodels!F171,Submodels!G162)","v":3.2906084502284307},"Submodel 4A5,4A6","Internal"]
["tpspSB",{"$f":"Submodels!D270","v":1.3113314730499244},"Submodel 4B6","Internal"]
["tpspSW",{"$f":"Submodels!D276","v":1},"Submodel 4B7","Internal"]
["WGRadj",false,"Input (required)","Input","TRUE / FALSE","Adjust pine density and DBH for WGR by excluding trees  with more than 50% girdling of main stem"]
["WGRadjNote",{"$f":"IF(WGRadj=TRUE,\"(adjusted for WGR) \",\" \")","v":" "},"Calculated","Output",null,"Indicates whether WGR adjustment used"]
["WGRAdjOut",{"$f":"IF(WGRadj=TRUE,\"Handover statistics adjusted for Western Gall Rust\",\"No adjustment for Western Gall Rust\")","v":"No adjustment for Western Gall Rust"},"Calculated","Output",null,"Indicates whether WGR adjustment used"]
["Weed",true,"Input (required)","Input","TRUE / FALSE","Chemical weed control during establishment stage (completed before establishment survey and YSD 8): TRUE or FALSE"]
["YSCperf",{"$f":"YrPerf-YrC","v":0},"Calculated","Internal",null,"Years since cut (based on Timber Year of Cut)  at performance asssessment"]
["YSCperfEarlyLate",{"$f":"IF(InYrPerf=0,\"Error: performance assessment year missing\",IF(YSCperf<11,\"Warning: performance assessment year less than 11 years after cut\",IF(YSCperf>14,\"Warning: performance assessment more than 14 years after cut\",\"Year OK\")))","v":"Warning: performance assessment year less than 11 years after cut"},"Calculated","Error and warnings","Stop error","Warning if performance assessment year missing or not between 11 and 14 years since cut"]
["YSCperfOut",{"$f":"IF(YSCzeroOutNote=\"Year OK\",IF(YSCperf<0,\" \",YSCperf),\" \")","v":0},"Calculated","Output",null,"Years since cut (based on Timber Year of Cut)  at performance asssessment"]
["YSCplant",{"$f":"IF(Plant=TRUE,YrP-YrC,\" \")","v":1},"Calculated","Internal"]
["YSCplantOut",{"$f":"IF(YSCplant<0,\" \",YSCplant)","v":1},"Calculated","Internal"]
["YSCprep",{"$f":"IF(Prep>1,YrPrep-YrC,\" \")","v":0},"Calculated","Internal"]
["YSCprepout",{"$f":"IF(YSCprep<0,\" \",YSCprep)","v":0},"Calculated","Internal"]
["YSCthin",{"$f":"YrThin-YrC","v":2},"Calculated","Internal",null,"Years since cut (based on Timber Year of Cut) at thinning"]
["YSCthinOut",{"$f":"IF(Thin=TRUE,YSCthin,\" \")","v":" "},"Calculated","Output",null,"Years since cut (at thinning (if Thin=TRUE)"]
["YSCthinInputOut",{"$f":"IF(OR(ThinInput=FALSE,YSCthin<0),\" \",YSCthin)","v":" "},"Calculated","Internal",null,"Years since cut (at thinning (if ThinInput=TRUE)"]
["YSChand",18,"Set","Internal",null,"Years since cut (based on Timber Year of Cut) at handover  - default = 18"]
["YSChandOut",{"$f":"IF(YSCzeroOutNote=\"Year OK\",YSChand,\" \")","v":18},"Calculated","Output (to GYPSY)",null,"Reported years since cut (based on Timber Year of Cut) at handover"]
["YSCweed",{"$f":"IF(Weed=TRUE,YrWeed-YrC,\" \")","v":6},"Calculated","Internal",null,"Years since last weed"]
["YSCweedOut",{"$f":"IF(YSCweed<0,\" \",YSCweed)","v":6},"Calculated","Internal"]
["YSCZeroOut",{"$f":"IF(AND(InYrC>1979,InYrC<2051),\"0\",\" \")","v":"0"},"Calculated","Internal"]
["YSCzeroOutNote",{"$f":"IF(InYrC=0,\"Error: year of cut missing\",IF(AND(InYrC>1979,InYrC<2051),\"Year OK\",\" \"))","v":"Year OK"},"Calculated","Error","Stop error","Warning if year of cut missing"]
["YrC",{"$f":"InYrC","v":2000},"Input (required)","Input","1980 to 2050","Timber year of cut"]
["YrCout",{"$f":"YrC","v":2000},"Calculated","Output",null,"Timber year of cut"]
["YrP",{"$f":"InYrP","v":2001},"Input (required)","Input","Minimum = YrC","Planting year: see warnings YrPearly, GSGhandLow"]
["YrPlantWarning",{"$f":"IF(AND(Plant=FALSE,InYrP=0),\"OK \",IF(Plant=FALSE,\"Year not required\",IF(YrP=0,\"Error: planting year missing\",IF(YrP<YrC,\"Error: planting before cut\",IF(AND(YrPrep>YrP,Prep>1),\"Error: planting before site preparation\",IF(GSGhand<16,\"Warning: long planting delay\",\"Year OK\"))))))","v":"Year OK"},"Calculated","Error and warnings","Stop error","Warning if planting year missing, before cut or site preparation, or delayed (adjusted and re-worded)"]
["YrPout",{"$f":"IF(Plant=TRUE,YrP,\"Never \")","v":2001},"Calculated","Output",null,"Planting year"]
["YrPerf",{"$f":"InYrPerf","v":2000},"Input (required)","Input","Minimum = YrC","Year of performance assessment"]
["YrPerfOut",{"$f":"YrPerf","v":2000},"Calculated","Output",null,"Year of performance assessment"]
["YrPrep",{"$f":"InYrPrep","v":2000},"Input (required if Prep = 1 or 2)","Input","Minimum = YrC","Site preparation year"]
["YrPrepOut",{"$f":"IF(Prep>1,YrPrep,\"Never\")","v":2000},"Calculated","Output",null,"Reported site prep year"]
["YrPrepWarning",{"$f":"IF(AND(Prep=1,InYrPrep=0),\"OK\",IF(Prep=1,\"Year not required\",IF(YrPrep=0,\"Error: site preparation year missing\",IF(YrPrep>YrC+3,\"Warning: site preparation delayed more than 3 years after cut\",IF(YrPrep<YrC,\"Error: site preparation before cut\",\"Year OK\")))))","v":"Year OK"},"Calculated","Error and warnings","Stop error","Warning if site preparation year missing, before cut, or delayed"]
["YrThin",{"$f":"InYrThin","v":2002},"Input (required if THIN=TRUE)","Input","Minimum = YrC","Thinning year"]
["YrThinWarning",{"$f":"IF(AND(ThinInput=FALSE,InYrThin=0),\"OK \",IF(ThinInput=FALSE,\"Year not required\",IF(InYrThin=0,\"Error: thinning year missing\",IF(IntThinHand>7,\"Warning: thinning early\",IF(IntThinHand<1,\"Error: thinning too late (in or after handover year)\",\"Year OK\")))))","v":"Year not required"},"Calculated","Error and warnings","Stop error","Warning if thinning year missing, too early (>7 years before handover), after handover"]
["YrThinOut",{"$f":"IF(Thin=TRUE,YrThin,\" Never\")","v":" Never"},"Calculated","Output",null,"Year of thinning"]
["YrHand",{"$f":"YrC+YSChand","v":2018},"Calculated","Output",null,"Year of handover"]
["YrHandOut",{"$f":"IF(YSCzeroOutNote=\"Year OK\",YrHand,\" \")","v":2018},"Calculated","Output",null,"Year of handout"]
["YrWeed",{"$f":"InYrWeed","v":2006},"Input (required if WEED= TRUE)","Input","Minimum = YrC","Latest year of chemical weeding"]
["YrWeedMax",{"$f":"IF(Weed=FALSE,\" \",YrC+8)","v":2008},"Calculated","Internal",null,"Latest acceptable year of chemical weeding"]
["YrWeedOut",{"$f":"IF(Weed=TRUE,YrWeed,\"Never\")","v":2006},"Calculated","Output",null,"Reported year of latest weeding"]
["YrWeedWarning",{"$f":"IF(AND(Weed=FALSE,InYrWeed=0),\"OK \",IF(Weed=FALSE,\"Year not required\",IF(YrWeed>YrC+9,\"Warning: weeding continued past modeled age range\",IF(YrWeed=0,\"Error: weeding year missing\",IF(YrWeed<YrC,\"Error: weeding before cut\",\"Year OK \")))))","v":"Year OK "},"Calculated","Error and warnings","Stop error","Warning if weeding year missing, before cut, after stocking survey,or more than 9 years after cut"]

{"sheet":"Submodels","index":4,"n_rows":506,"n_cols":21,"rows_kept":506,"cut":false,"hidden":true,"merged":[]}
["1A","Mean annual mortality of unthinned lodgepole pine planted stock to handover age",null,null,null,null,null,null,null,null,null,null,null,null,null,null,"Original","Revisions1","Revisions2"]
["Ln1mP","Transformation: mP = exp(LN1mP)-1"]
["Intercept","1Aa",7.2803319000000002]
["PrepB[MSP]","1Ab",-0.149253]
["NSR[LF]","1Ac",0.1233784]
["SMCb[MesicDry]","1Ad",0.1024504]
["Lat","1Ae",-0.122209]
["denAWh","1Af",3.9700000000000003E-5]
["LFH","1Ag",1.4630000000000001E-2]
["PrepB","NSR","SMCb","Index","Ln1mP","mp","denPLpPerfB","denPLpThinB","denPLpHandB"]
[{"$f":"PrepB","v":"MSP"},{"$f":"NSR","v":2},{"$f":"SMCb","v":"MesicDry"},{"$f":"INDEX(A12:D19,MATCH(A11&B11&C11,A12:A19&B12:B19&C12:C19,0),4)","v":7},{"$f":"LOOKUP(D11,D12:D19,E12:E19)","v":1.0134511057710445},{"$f":"EXP(E11)-1","v":1.7550927435838015},{"$f":" nP*(1-($F11/100*GSPperf))","v":407.02037097433521},{"$f":" nP*(1-($F11/100*GSPthin))","v":392.97962902566479},{"$f":" nP*(1-($F11/100*GSPhand))","v":280.65369343630147},null,null,null,null,null,null,null,null,null,"Potential negative values set to zero in Variables worksheet"]
["None",1,"MesicDry",1,{"$f":"_1Aa+_1Ab*(-1)+_1Ac*1+_1Ad*1+_1Ae*Lat+_1Af*denAWhandB+_1Ag*LFH","v":1.5587139057710444},{"$f":"EXP(E12)-1","v":3.7527048865476509}]
["None",1,"Moist",2,{"$f":"_1Aa+_1Ab*(-1)+_1Ac*1+_1Ad*(-1)+_1Ae*Lat+_1Af*denAWhandB+_1Ag*LFH","v":1.3538131057710434},2.8721623809780015]
["None",2,"MesicDry",3,{"$f":"_1Aa+_1Ab*(-1)+_1Ac*(-1)+_1Ad*1+_1Ae*Lat+_1Af*denAWhandB+_1Ag*LFH","v":1.3119571057710442},2.7134341886135314]
["None",2,"Moist",4,{"$f":"_1Aa+_1Ab*(-1)+_1Ac*(-1)+_1Ad*(-1)+_1Ae*Lat+_1Af*denAWhandB+_1Ag*LFH","v":1.1070563057710434},2.0254393051178399]
["MSP",1,"MesicDry",5,{"$f":"_1Aa+_1Ab*1+_1Ac*1+_1Ad*1+_1Ae*Lat+_1Af*denAWhandB+_1Ag*LFH","v":1.2602079057710445},2.5261545190360866]
["MSP",1,"Moist",6,{"$f":"_1Aa+_1Ab*1+_1Ac*1+_1Ad*(-1)+_1Ae*Lat+_1Af*denAWhandB+_1Ag*LFH","v":1.0553071057710437},1.8728572894929356]
["MSP",2,"MesicDry",7,{"$f":"_1Aa+_1Ab*1+_1Ac*(-1)+_1Ad*1+_1Ae*Lat+_1Af*denAWhandB+_1Ag*LFH","v":1.0134511057710445},1.7550927435838015]
["MSP",2,"Moist",8,{"$f":"_1Aa+_1Ab*1+_1Ac*(-1)+_1Ad*(-1)+_1Ae*Lat+_1Af*denAWhandB+_1Ag*LFH","v":0.8085503057710437},1.2446515684166517]
["1B","Mean annual mortality of thinned lodgepole pine planted stock to handover age"]
["LN1mT","Transformation: mT = exp(LN1mT)-1"]
["Intercept","1Ba",0.92183649999999995]
["SNCb[B]","1Bb",-0.171878]
["spinAW","1Bc",0.32489990000000002]
["Elev","1Bd",-6.2399999999999999E-4]
["nP","1Be",6.8800000000000005E-5]
["SNCb","Ln1mP","mp","denPLpPerfA","denPLpThinA","denPLpHandB","denPLpPerfAadj","denPLpThinAadj",null,null,null,null,null,null,null,null,null,null,"Potential negative values set to zero in Variables worksheet"]
[{"$f":"IF(SNC=1,\"B\",\"CD\")","v":"CD"},{"$f":"IF(A28=\"B\",B29,B30)","v":0.4051586520220587},{"$f":"EXP(B28)-1","v":0.49954038630014641},{"$f":"nTp*1/(1-($C28/100*IntPerfHand))","v":308.38261626237352},{"$f":"nTp*1/(1-($C28/100*IntThinHand))","v":305.03398020533234},{"$f":"nTp*1","v":280.65369343630147},{"$f":"IF(D28<F28,F28,D28)","v":308.38261626237352},{"$f":"IF(E28<F28,F28,E28)","v":305.03398020533234},null,null,null,null,null,null,null,null,null,null,"Perf and Thin values constrained to be not less than Hand"]
["B",{"$f":"_1Ba+_1Bb+_1Bc*spinAW+_1Bd*Elev+_1Be*nP","v":6.140265202205876E-2}]
["CD",{"$f":"_1Ba+_1Bb*(-1)+_1Bc*spinAW+_1Bd*Elev+_1Be*nP","v":0.4051586520220587}]
["2A","Stems per ha of unthinned lodgepole pine natural regeneration at handover stage (with SSPT adjustment)"]
["SQRTdenPLnHand","Transformation: denPLnHand = (SQRTdenPLnHand)^2"]
["Intercept","2Aa",318.45900999999998]
["PrepC[Drag]","2Ab",15.816305]
[null,"2Ac",null,"(Not used)"]
["SNC[B]","2Ad",-8.4157430000000009]
["SNC[C]","2Ae",13.193607]
["Lat","2Af",-5.1704990000000004]
["denAW","2Ag",-3.1900000000000001E-3]
["nP1600Less","2Ah",-8.2480000000000001E-3]
["LN1Cones","2Ai",22.081143999999998]
["LFH","2Aj",-1.044781]
["Prep","SNC","Index","SQRTdenPLnHand","denPLnHand2A"]
[{"$f":"Prep","v":2},{"$f":"SNC","v":2},{"$f":"INDEX(A45:C53,MATCH(A44&B44,A45:A53&B45:B53,0),3)","v":5},{"$f":"LOOKUP(C44,C45:C53,D45:D53)","v":69.907314027383777},{"$f":"LOOKUP(C44,C45:C53,E45:E53)","v":4887.0325545232481},"Note: Prep 1 and 3 are the same"]
[1,1,1,{"$f":"_2Aa+_2Ab*(-1)+_2Ad*1+_2Ae*0+_2Af*Lat+_2Ag*denAWhandB+_2Ah*nP1600Less+_2Ai*LN1Cones+_2Aj*LFH","v":16.665354027383756},{"$f":"IF(D45<0,0,D45^2)","v":277.73402485803598}]
[1,2,2,{"$f":"_2Aa+_2Ab*(-1)+_2Ad*0+_2Ae*1+_2Af*Lat+_2Ag*denAWhandB+_2Ah*nP1600Less+_2Ai*LN1Cones+_2Aj*LFH","v":38.274704027383763},{"$f":"IF(D46<0,0,D46^2)","v":1464.9529683838268}]
[1,3,3,{"$f":"_2Aa+_2Ab*(-1)+_2Ad*(-1)+_2Ae*(-1)+_2Af*Lat+_2Ag*denAWhandB+_2Ah*nP1600Less+_2Ai*LN1Cones+_2Aj*LFH","v":20.303233027383811},{"$f":"IF(D47<0,0,IF(D47^2>5300,5300,D47^2))","v":412.22127136424882},"Note maximum limited"]
[2,1,4,{"$f":"_2Aa+_2Ab*1+_2Ad*1+_2Ae*0+_2Af*Lat+_2Ag*denAWhandB+_2Ah*nP1600Less+_2Ai*LN1Cones+_2Aj*LFH","v":48.297964027383756},{"$f":"IF(D48<0,0,D48^2)","v":2332.6933291904552}]
[2,2,5,{"$f":"_2Aa+_2Ab*1+_2Ad*0+_2Ae*1+_2Af*Lat+_2Ag*denAWhandB+_2Ah*nP1600Less+_2Ai*LN1Cones+_2Aj*LFH","v":69.907314027383777},{"$f":"IF(D49<0,0,D49^2)","v":4887.0325545232481}]
[2,3,6,{"$f":"_2Aa+_2Ab*1+_2Ad*(-1)+_2Ae*(-1)+_2Af*Lat+_2Ag*denAWhandB+_2Ah*nP1600Less+_2Ai*LN1Cones+_2Aj*LFH","v":51.935843027383811},{"$f":"IF(D50<0,0,IF(D50^2>5300,5300,D50^2))","v":2697.3317909650518},"Note maximum limited"]
[3,1,7,{"$f":"_2Aa+_2Ab*(-1)+_2Ad*1+_2Ae*0+_2Af*Lat+_2Ag*denAWhandB+_2Ah*nP1600Less+_2Ai*LN1Cones+_2Aj*LFH","v":16.665354027383756},{"$f":"IF(D51<0,0,D51^2)","v":277.73402485803598}]
[3,2,8,{"$f":"_2Aa+_2Ab*(-1)+_2Ad*0+_2Ae*1+_2Af*Lat+_2Ag*denAWhandB+_2Ah*nP1600Less+_2Ai*LN1Cones+_2Aj*LFH","v":38.274704027383763},{"$f":"IF(D52<0,0,D52^2)","v":1464.9529683838268}]
[3,3,9,{"$f":"_2Aa+_2Ab*(-1)+_2Ad*(-1)+_2Ae*(-1)+_2Af*Lat+_2Ag*denAWhandB+_2Ah*nP1600Less+_2Ai*LN1Cones+_2Aj*LFH","v":20.303233027383811},{"$f":"IF(D53<0,0,IF(D53^2>6562,6562,D53^2))","v":412.22127136424882},"Note maximum limited"]
["2Bnt (not thinned)","Stems per ha of unthinned lodgepole pine natural regeneration at performance and thinning stage"]
["SQRTdenPLn","Transformation: denPLn = (SQRTdenPLn)^2"]
["Intercept","2Ca",3.5594530999999998]
["SQRTdenPLnHand","2Cb",1.2230386]
["Thin[No]","2Cc",2.1547925000000001]
["Thin","SQRTdenPLn","denPLnPerf2C"]
[{"$f":"Thin","v":false},{"$f":"IF(Thin=TRUE,B61,B62)","v":91.213589077811818},{"$f":"B60^2","v":8319.9188324559109}]
[true,{"$f":"_2Ca+_2Cb*SQRTdenPLnHandA+_2Cc*(-1)","v":75.993435235497486},{"$f":"B61^2","v":5775.0021988917506}]
[false,{"$f":"_2Ca+_2Cb*SQRTdenPLnHandB+_2Cc*1","v":91.213589077811818},{"$f":"IF(B62<0,0,B62^2)","v":8319.9188324559109},"denPLnPerfB"]
["2Ct (thinned)","Stems per ha of thinned lodgepole pine natural regeneration at performance and thinning stage"]
["SQRTdenPLn","Transformation: denPLn = (SQRTdenPLn)^2"]
["Intercept","2Ca",3.5594530999999998]
["SQRTdenPLnHand","2Cb",1.2230386]
["Thin[No]","2Cc",2.1547925000000001]
["Thin","SQRTdenPLn","denPLnPerf2C"]
[{"$f":"Thin","v":false},{"$f":"IF(Thin=TRUE,B70,B71)","v":91.213589077811818},{"$f":"B69^2","v":8319.9188324559109}]
[true,{"$f":"_2Ca+_2Cb*SQRTdenPLnHandA+_2Cc*(-1)","v":75.993435235497486},{"$f":"IF(B70<0,0,B70^2)","v":5775.0021988917506},"denPLnPerfA"]
[false,{"$f":"_2Ca+_2Cb*SQRTdenPLnHandB+_2Cc*1","v":91.213589077811818},{"$f":"B71^2","v":8319.9188324559109}]
["3A","Percent stocking pine (1.3m+) in planted stands at handover stage"]
["sPL13Plant","Transformation: sPL13 = ((1 + eY)-1)"]
["Intercept","3Aa",2.6393527300000001]
["Thinned[No]","3Ab",0.40137704000000002]
["SQRTdenPLnHand","3Ac",-4.4646999999999999E-2,null,"Note: if thinned,use  nTn"]
["SQRTdenPLpHand","3Ad",-0.1093307,null,"Note: if thinned, use nTP"]
["Thin","y","sPLhand","psPLhand","yX","sPhandX","psPLhandX"]
[{"$f":"Thin","v":false},{"$f":"IF(Thin=TRUE,B80,B81)","v":-1.9120088993710909},{"$f":"((1+EXP(B79))^-1)","v":0.87124466906975218},{"$f":"C79*100","v":87.124466906975215},null,null,null,null,null,null,null,null,null,null,null,null,"Not used"]
[true,{"$f":"_3Aa+_3Ab*(-1)+_3Ac*SQRTdenPLnHandA+_3Ad*SQRTdenPLpHandA","v":-2.3164728787129363},{"$f":"((1+EXP(B80))^-1)","v":0.91023215778153244},{"$f":"IF(C80<denPLhandA*MaxSD,C80*100,denPLhandA*MaxSD*100)","v":91.023215778153244},{"$f":"_3Aa+_3Ab*(-1)+_3Ac*SQRTdenPLnHandXa+_3Ad*SQRTdenPLpHandXa","v":-1.7719867056081799},{"$f":"((1+EXP(E80))^-1)","v":0.85470456335100797},{"$f":"IF(F80<denPLhandXa*MaxSD,F80*100,denPLhandXa*MaxSD*100)","v":85.470456335100792},"A",null,null,null,null,null,null,null,null,"Constrained"]
[false,{"$f":"_3Aa+_3Ab*1+_3Ac*SQRTdenPLnHandB+_3Ad*SQRTdenPLpHandB","v":-1.9120088993710909},0.87124466906975218,{"$f":"IF(C81<denPLhandB*MaxSD,C81*100,denPLhandB*MaxSD*100)","v":87.124466906975215},{"$f":"_3Aa+_3Ab*1+_3Ac*SQRTdenPLnHandXb+_3Ad*SQRTdenPLpHandXb","v":-1.3103492048389485},0.78757158461616628,{"$f":"IF(F81<denPLhandXb*MaxSD,F81*100,denPLhandXb*MaxSD*100)","v":78.757158461616626},"B",null,null,null,null,null,null,null,null,"Constrained"]
["3B","Percent stocking pine (1.3m+) in unplanted (leave for natural) stands at handover stage"]
["sPL13Lfn","Transformation: sPL13 = ((1 + eY)-1)"]
["Intercept","3Ba",3.4111420799999999]
["Thinned[No]","3Bb",0.31759736999999999]
["SQRTdenPLnHand","3Bc",-9.02168E-2,null,null,"Note: if thinned, use nTn"]
["Thin","y","sPLhand","psPLhand","yX","sPhandX","psPLhandX"]
[{"$f":"Thin","v":false},{"$f":"IF(Thin=TRUE,B89,B90)","v":-2.5780747181456771},{"$f":"((1+EXP(B88))^-1)","v":0.92943710621025255},{"$f":"C88*100","v":92.943710621025261},null,null,null,null,null,null,null,null,null,null,null,null,"Not used"]
[true,{"$f":"_3Ba+_3Bb*(-1)+_3Bc*SQRTdenPLnHandA","v":-2.4084570776261218},{"$f":"((1+EXP(B89))^-1)","v":0.91746992877767697},{"$f":"IF(C89<denPLhandA*MaxSD,C89*100,denPLhandA*MaxSD*100)","v":91.746992877767696},{"$f":"_3Ba+_3Bb*(-1)+_3Bc*SQRTdenPLnHandXa","v":-1.6186588461899261},{"$f":"((1+EXP(E89))^-1)","v":0.83461008524921254},{"$f":"IF(F89<denPLhandXa*MaxSD,F89*100,denPLhandXa*MaxSD*100)","v":83.461008524921255},"A",null,null,null,null,null,null,null,null,"Constrained"]
[false,{"$f":"_3Ba+_3Bb*1+_3Bc*SQRTdenPLnHandB","v":-2.5780747181456771},0.92943710621025255,{"$f":"IF(C90<denPLhandB*MaxSD,C90*100,denPLhandB*MaxSD*100)","v":92.943710621025261},{"$f":"_3Ba+_3Bb*1+_3Bc*SQRTdenPLnHandXb","v":-1.6727477356643901},0.84194182190197286,{"$f":"IF(F90<denPLhandXb*MaxSD,F90*100,denPLhandXb*MaxSD*100)","v":84.194182190197282},"B",null,null,null,null,null,null,null,null,"Constrained"]
["3C","Percent stocking pine (30cm+) in planted stands during performance and thinning stage"]
["Model sPL03plant","Transformation: sPL = ((1 + eY)-1)"]
["Intercept","3Ca",2.56435842]
["Thinned[No]","3Cb",0.28250839999999999]
["SQRTdenPLnPerf","3Cc",-3.4787199999999997E-2]
["SQRTdenPLpPerf","3Cd",-0.1090304]
["Thin","y-perf","sPLperfPlant","psPLplantPerf","y-thin","sPLthinPlant","psPLplantThin"]
[{"$f":"Thin","v":false},{"$f":"IF(Thin=TRUE,B99,B100)","v":-2.5258591582214054},{"$f":"((1+EXP(B98))^-1)","v":0.92593487699987631},{"$f":"C98*100","v":92.593487699987634},{"$f":"IF(Thin=TRUE,E99,E100)","v":-2.4875859916208993},{"$f":"((1+EXP(E98))^-1)","v":0.92326695667152259},{"$f":"F98*100","v":92.326695667152265},null,null,null,null,null,null,null,null,null,"Not used"]
[true,{"$f":"_3Ca+_3Cb*(-1)+_3Cc*SQRTdenPLnPerfA+_3Cd*SQRTdenPLpPerfA","v":-2.2764127133891936},{"$f":"((1+EXP(B99))^-1)","v":0.90690461895840357},{"$f":"IF(C99<denPLperfA*MaxSD,C99*100,denPLperfA*MaxSD*100)","v":90.690461895840357},{"$f":"_3Ca+_3Cb*(-1)+_3Cc*SQRTdenPLnThinA+_3Cd*SQRTdenPLpThinA","v":-2.2659889531457136},{"$f":"((1+EXP(E99))^-1)","v":0.90602081451739847},{"$f":"IF(F99<denPLthinA*MaxSD,F99*100,denPLthinA*MaxSD*100)","v":{"$error":"#VALUE!"}},"A",null,null,null,null,null,null,null,null,"Constrained"]
[false,{"$f":"_3Ca+_3Cb*1+_3Cc*SQRTdenPLnPerfB+_3Cd*SQRTdenPLpPerfB","v":-2.5258591582214054},0.92593487699987631,{"$f":"IF(C100<denPLperfB*MaxSD,C100*100,denPLperfB*MaxSD*100)","v":92.593487699987634},{"$f":"_3Ca+_3Cb*1+_3Cc*SQRTdenPLnThinB+_3Cd*SQRTdenPLpThinB","v":-2.4875859916208993},0.92326695667152259,{"$f":"IF(F100<denPLthinB*MaxSD,F100*100,denPLthinB*MaxSD*100)","v":{"$error":"#VALUE!"}},"B",null,null,null,null,null,null,null,null,"Constrained"]
["3D","Percent stocking pine (30cm+) in unplanted (leave for natural) stands during performance and thinning stage"]
["sPL03Lfn","Transformation: sPL = ((1 + eY)-1)"]
["Intercept","3Da",2.6812157399999998]
["Thinned[No]","3Db",0.24992337000000001]
["SQRTdenPLnPerf","3Dc",-6.4364099999999994E-2]
["Thin","y-perf","sPLperfLfn","psPLlfnPerf","y-thin","sPLthinLfn","psPLPLlfnThin"]
[{"$f":"Thin","v":false},{"$f":"IF(Thin=TRUE,B108,B109)","v":-2.9397414587631876},{"$f":"((1+EXP(B107))^-1)","v":0.94977639551805237},{"$f":"C107*100","v":94.97763955180524},{"$f":"IF(Thin=TRUE,E108,E109)","v":-2.9397414587631876},{"$f":"((1+EXP(E107))^-1)","v":0.94977639551805237},{"$f":"F107*100","v":94.97763955180524},null,null,null,null,null,null,null,null,null,"Not used"]
[true,{"$f":"_3Da+_3Db*(-1)+_3Dc*SQRTdenPLnPerfA","v":-2.4599566948410829},{"$f":"((1+EXP(B108))^-1)","v":0.92128652249770826},{"$f":"IF(C108<denPLperfA*MaxSD,C108*100,denPLperfA*MaxSD*100)","v":92.128652249770823},{"$f":"_3Da+_3Db*(-1)+_3Dc*SQRTdenPLnThinA","v":-2.4599566948410829},{"$f":"((1+EXP(E108))^-1)","v":0.92128652249770826},{"$f":"IF(F108<denPLthinA*MaxSD,F108*100,denPLthinA*MaxSD*100)","v":{"$error":"#VALUE!"}},"A",null,null,null,null,null,null,null,null,"Constrained"]
[false,{"$f":"_3Da+_3Db*1+_3Dc*SQRTdenPLnPerfB","v":-2.9397414587631876},0.94977639551805237,{"$f":"IF(C109<denPLperfB*MaxSD,C109*100,denPLperfB*MaxSD*100)","v":94.97763955180524},{"$f":"_3Da+_3Db*1+_3Dc*SQRTdenPLnThinB","v":-2.9397414587631876},0.94977639551805237,{"$f":"IF(F109<denPLthinB*MaxSD,F109*100,denPLthinB*MaxSD*100)","v":{"$error":"#VALUE!"}},"B",null,null,null,null,null,null,null,null,"Constrained"]
["4A1","Stocking probability index for aspen/poplar (1.3m+) in unweeded stands"]
["spinAW","Transformation: spinAW = ((1 + eY)-1)",null,null,null,null,null,null,null,null,null,null,null,null,null,null,null,null,"Revised model 4A1 based on C, T plots only, avoiding possible bias caused by including  unweeded W and WT plots"]
["Intercept","4A1a",-9.8674522000000007,null,null,null,null,null,null,null,null,null,null,null,null,null,-10.718688,null,-9.8674522000000007]
["SNC[B]","4A1b",2.9547378000000002,null,null,null,null,null,null,null,null,null,null,null,null,null,2.9302280299999999,null,2.9547378000000002]
["SNC[C]","4A1c",-0.43959330000000002,null,null,null,null,null,null,null,null,null,null,null,null,null,-0.28093899999999999,null,-0.43959330000000002]
["Elev","4A1d",1.052609E-2,null,null,null,null,null,null,null,null,null,null,null,null,null,1.142429E-2,null,1.052609E-2]
["SNC","y","spinAW4A1"]
[{"$f":"SNC","v":2},{"$f":"IF(SNC=1,B118,IF(SNC=2,B119,B120))","v":0.85060989999999848},{"$f":"((1+EXP(B117))^-1)","v":0.29930493273476066}]
[1,{"$f":"_4A1a+_4A1b*1+_4A1c*0+_4A1d*Elev","v":5.2975499999999993},{"$f":"((1+EXP(B118))^-1)","v":4.9789245717542898E-3}]
[2,{"$f":"_4A1a+_4A1b*0+_4A1c*1+_4A1d*(Elev-100)","v":0.85060989999999848},0.29930493273476066,null,null,null,null,null,null,null,null,null,null,null,null,null,null,null,"Elevation adjustment -100"]
[3,{"$f":"_4A1a+_4A1b*(-1)+_4A1c*(-1)+_4A1d*Elev","v":-0.17233230000000077},0.54297676576663678]
["4A2","Stocking probability index for aspen/poplar (1.3m+) - weeded"]
["spinAW","Stratum averages for establishment (GS7)"]
["SNC","spinAW","spinAW4A2"]
[{"$f":"SNC","v":2},{"$f":"IF(SNC=1,B125,IF(SNC=2,B126,B127))","v":2.389705882352941E-2},{"$f":"IF(B124<C117,B124,C117)","v":2.389705882352941E-2}]
[1,8.9285714285714281E-3]
[2,2.389705882352941E-2]
[3,2.7439024390243903E-2]
["4A3NoWeed","Stocking probability unthinned unweeded aspen/poplar(1.3m+) during performance and handover stages",null,null,null,null,null,null,null,null,null,null,null,null,null,null,null,null,"New model"]
["sAw"]
["Intercept","4A3NWa",1.0623165699999999,null,null,null,null,null,null,null,null,null,null,null,null,null,null,null,1.0623165699999999]
["SNC[B]","4A3NWb",0.74389368,null,null,null,null,null,null,null,null,null,null,null,null,null,null,null,0.74389368]
["SNC[C]","4A3NWc",-0.47343800000000003,null,null,null,null,null,null,null,null,null,null,null,null,null,null,null,-0.47343800000000003]
["Elev","4A3NWd",1.3685800000000001E-3,null,null,null,null,null,null,null,null,null,null,null,null,null,null,null,1.3685800000000001E-3]
["spinAwPb","4A3NWe",-5.2519520999999996,null,null,null,null,null,null,null,null,null,null,null,null,null,null,null,-5.2519520999999996]
["SNC","y","sAW","psAW"]
[{"$f":"SNC","v":2},{"$f":"IF(SNC=1,B137,IF(SNC=2,B138,B139))","v":2.0509251617279411},{"$f":"((1+EXP(B136))^-1)","v":0.11395893220910966},{"$f":"C136*100","v":11.395893220910965}]
[1,{"$f":"_4A3NWa+_4A3NWb*1+_4A3NWc*0+_4A3NWd*Elev+_4A3NWe*spinAW","v":3.2682568417279412},{"$f":"((1+EXP(B137))^-1)","v":3.6676366449828662E-2}]
[2,{"$f":"_4A3NWa+_4A3NWb*0+_4A3NWc*1+_4A3NWd*(Elev)+_4A3NWe*spinAW","v":2.0509251617279411},0.11395893220910966]
[3,{"$f":"_4A3NWa+_4A3NWb*(-1)+_4A3NWc*(-1)+_4A3NWd*Elev+_4A3NWe*spinAW","v":2.253907481727941},9.501294607712521E-2]
["4A3Weed","Stocking probability unthinned weeded aspen/poplar(1.3m+) during performance and handover stages",null,null,null,null,null,null,null,null,null,null,null,null,null,null,null,null,"New model"]
["sAW"]
["Intercept","4A3Wa",1.1796963600000001,null,null,null,null,null,null,null,null,null,null,null,null,null,null,null,1.1796963600000001]
["Elev","4A3Wb",2.2516599999999999E-3,null,null,null,null,null,null,null,null,null,null,null,null,null,null,null,2.2516599999999999E-3]
["spinAwPb","4A3Wc",-14.710444000000001,null,null,null,null,null,null,null,null,null,null,null,null,null,null,null,-14.710444000000001]
["y","sAW","psAW"]
[{"$f":"_4A3Wa+_4A3Wb*(Elev)+_4A3Wc*spinAW","v":3.4400856144117644},{"$f":"((1+EXP(A146))^-1)","v":3.1065906992511098E-2},{"$f":"IF((B146*100*1.615)>100,100,(B146*100*1.615))","v":5.0171439792905419},null,null,null,null,null,null,null,null,null,null,null,null,null,null,null,"Adjustment factor 1.615 applied based on RLP trends and outlier removals"]
["4A4","Stocking probability of thinned aspen / poplar(1.3m+) during performance and handover stages"]
["sAWt","Transformation: sAWt = ((1 + eY)-1)",null,null,null,null,null,null,null,null,null,null,null,null,null,null,null,null,"Original retained",null,"Alternative"]
["Intercept","4A4a",5.6253416500000002,null,null,null,null,null,null,null,null,null,null,null,null,null,5.6253416500000002,null,5.6253416500000002,null,5.0870471200000003]
["spinAW","4A4b",-3.9612752000000002,null,null,null,null,null,null,null,null,null,null,null,null,null,-3.9612752000000002,null,-3.9612752000000002,null,-3.0766103999999999]
["GST","4A4c",-0.49631760000000003,null,null,null,null,null,null,null,null,null,null,null,null,null,-0.49631760000000003,null,-0.49631760000000003,null,-0.54564380000000001]
["Y-perf","sAWperf","psAWperf","sAWperf4A4","psAWperfA","Y-thin","sAWthin","psAWthin","sAWthin4A4","psAWthinA","Y-hand","sAWhand","psAWhand","sAWhand4A4","psAWhandA"]
[{"$f":"IF(IntThinPerf<0,\" \",_4A4a+_4A4b*spinAW+_4A4c*IntThinPerf)","v":" "},{"$f":"((1+EXP(A153))^-1)","v":{"$error":"#VALUE!"}},{"$f":"B153*100","v":{"$error":"#VALUE!"}},{"$f":"IF(spinAW>0,B153,B153)","v":{"$error":"#VALUE!"}},{"$f":"IF(spinAW>0,C153,C153)","v":{"$error":"#VALUE!"}},{"$f":"_4A4a+_4A4b*spinAW+_4A4c*0","v":5.5306788235294118},{"$f":"((1+EXP(F153))^-1)","v":3.9476520751712402E-3},{"$f":"G153*100","v":0.39476520751712402},{"$f":"IF(spinAW>0,G153,G153)","v":3.9476520751712402E-3},{"$f":"IF(spinAW>0,H153,H153)","v":0.39476520751712402},{"$f":"IF(IntThinHand<0,\" \",_4A4a+_4A4b*spinAW+_4A4c*IntThinHand)","v":-2.4104027764705886},{"$f":"((1+EXP(K153))^-1)","v":0.91761713525533628},{"$f":"L153*100","v":91.761713525533622},{"$f":"IF(spinAW>0,L153,L153)","v":0.91761713525533628},{"$f":"IF(spinAW>0,M153,M153)","v":91.761713525533622},null,null,"Note: set to zero if spinaAW=0","Condition removed"]
["4A5","Trees per stocked plot of unweeded unthinned aspen / poplar (1.3m+) during performance and handover stages"]
["LNtpspAW","Transformation: tpspAW = EXP(LNtpspAW)",null,null,null,null,null,null,null,null,null,null,null,null,null,null,null,null,"Revised model 4A5. Based on only C treatment plots. Latitude removed. spinAW 0 plots retained"]
["Intercept","4A5a",2.0045586000000002,null,null,null,null,null,null,null,null,null,null,null,null,null,11.135025000000001,null,2.0045586000000002]
["spinAW","4A5b",1.5858104,null,null,null,null,null,null,null,null,null,null,null,null,null,1.7413373999999999,null,1.5858104]
["YSC","4A5c",-8.5170999999999997E-2,null,null,null,null,null,null,null,null,null,null,null,null,null,-8.7160000000000001E-2,null,-8.5170999999999997E-2]
["NSR[LF]","4A5d",0.3412056,null,null,null,null,null,null,null,null,null,null,null,null,null,0.27670929999999999,null,0.3412056]
["Lat","4A5e",0,null,null,null,null,null,null,null,null,null,null,null,null,null,-0.17158200000000001,null,0]
["NSR","LNtpspAWperf","tpspAWperf4A5","LNtpspAWhand","tpspAWhand4A5","LNtpspAWthin","tpspAWthin4A5"]
[{"$f":"NSR","v":2},{"$f":"IF(NSR=1,B163,B164)","v":1.7012492044117651},{"$f":"IF(EXP(B162)<1,1,EXP(B162)*1.04)","v":5.7000213335698122},{"$f":"IF(NSR=1,D163,D164)","v":0.16817120441176503},{"$f":"IF(EXP(D162)<1,1,EXP(D162)*1.04)","v":1.2304647180299551},{"$f":"IF(NSR=1,F163,F164)","v":1.5309072044117649},{"$f":"IF(EXP(F162)<1,1,EXP(F162)*1.04)","v":4.8072630878351967},null,null,null,null,null,null,null,null,null,"Cannot be <1",null,"Adjustment factor 1.040 applied based on RLP stratum means"]
["LF",{"$f":"_4A5a+_4A5b*spinAW+_4A5c*YSCperf+_4A5d*1+_4A5e*Lat","v":2.3836604044117649},{"$f":"EXP(B163)","v":10.844525651515641},{"$f":"_4A5a+_4A5b*spinAW+_4A5c*YSChand+_4A5d*1+_4A5e*Lat","v":0.85058240441176503},{"$f":"EXP(D163)","v":2.341009869449707},{"$f":"_4A5a+_4A5b*spinAW+_4A5c*YSCthin+_4A5d*1+_4A5e*Lat","v":2.2133184044117651},{"$f":"EXP(F163)","v":9.1460162723572722}]
["UF",{"$f":"_4A5a+_4A5b*spinAW+_4A5c*YSCperf+_4A5d*(-1)+_4A5e*Lat","v":1.7012492044117651},5.4807897438171267,{"$f":"_4A5a+_4A5b*spinAW+_4A5c*YSChand+_4A5d*(-1)+_4A5e*Lat","v":0.16817120441176503},1.1831391519518799,{"$f":"_4A5a+_4A5b*spinAW+_4A5c*YSCthin+_4A5d*(-1)+_4A5e*Lat","v":1.5309072044117649},4.6223683536876887]
["4A6","Trees per stocked plot of weeded unthinned aspen / poplar (1.3m+) during performance and handover stages"]
["LNtpspAW","Transformation: tpspAW = EXP(LNtpspAW)",null,null,null,null,null,null,null,null,null,null,null,null,null,null,null,"Original model checked and retained"]
["Intercept","4A6a",0.93784840000000003]
["spinAW","4A6b",5.5998424]
["YSC","4A6c",-5.8229000000000003E-2]
["LNtpspAWperf","tpspAWperf4A6","LNtpspAWhand","tpspAWhand4A6","LNtpspAWthin","tpspAWthin"]
[{"$f":"_4A6a+_4A6b*spinAWweed+_4A6c*YSCperf","v":1.071668163235294},{"$f":"IF(EXP(A171)<1,1,EXP(A171)*1.266)","v":3.697032559632667},{"$f":"_4A6a+_4A6b*spinAWweed+_4A6c*YSChand","v":2.3546163235294015E-2},{"$f":"IF(EXP(C171)<1,1,EXP(C171)*1.266)","v":1.2961631624492109},{"$f":"_4A6a+_4A6b*spinAWweed+_4A6c*YSCthin","v":0.95521016323529406},{"$f":"IF(EXP(E171)<1,1,EXP(E171)*1.266)","v":3.2906084502284307},null,null,null,null,null,null,null,null,null,null,"Cannot be < 1",null,"Adjustment factor 1.266 applied based on RLP stratum means"]
["4A7","Trees per stocked plot of thinned aspen / poplar (1.3m+) during performance and handover stages"]
["LNtpspAW","Transformation: tpspAW = EXP(LNtpspAW)",null,null,null,null,null,null,null,null,null,null,null,null,null,null,null,"Original model checked and retained"]
["Intercept","4A7a",0.32096770000000002]
["spinAW","4A7b",1.5184861000000001]
["NSR[LF]","4A7c",0.1990344]
["NSR","LNtpspAW","tpspAW4A7"]
[{"$f":"NSR","v":2},{"$f":"IF(NSR=1,B179,B180)","v":0.15822065165441179},{"$f":"IF(EXP(B178)<1,1,EXP(B178)*1.298)","v":1.5205091865862144},null,null,null,null,null,null,null,null,null,null,null,null,null,"Cannot be <1",null,"Adjustment factor 1.298 applied based on RLP stratum means"]
["LF",{"$f":"_4A7a+_4A7b*spinAW+_4A7c*1","v":0.55628945165441179},{"$f":"EXP(B179)","v":1.7441885822314893}]
["UF",{"$f":"_4A7a+_4A7b*spinAW+_4A7c*(-1)","v":0.15822065165441179},1.1714246429785935]
["4B1","Stocking probability index of black spruce (30cm+)"]
["spinSB","Transformation: spinSB = ((1 + eY)-1)"]
["Intercept","4B1a",4.2822679299999997]
["NSR[LF]","4B1b",0.97900427000000001]
["SMC[Dry]","4B1c",1.9863219700000001]
["SMC[Mesic]","4B1d",-1.0862343999999999]
["SNCb[B]","4B1e",-0.92206350000000004]
["LFH","4B1f",-3.6563499999999999E-2]
["Slope","4B1g",0.19538885]
["NSR","SMC","SNCb","Index","Y","spinSB"]
[{"$f":"NSR","v":2},{"$f":"SMC","v":2},{"$f":"SNCb","v":"CD"},{"$f":"INDEX(A192:D203,MATCH(A191&B191&C191,A192:A203&B192:B203&C192:C203,0),4)","v":10},{"$f":"LOOKUP(D191,D192:D203,E192:E203)","v":2.8237431600000003},{"$f":"((1+EXP(E191))^-1)","v":5.6054544429132873E-2}]
[1,1,"B",1,{"$f":"_4B1a+_4B1b*1+_4B1c*1+_4B1d*0+_4B1e*1+_4B1f*LFH+_4B1g*Slope","v":6.0101810699999998},2.4476382263919692E-3]
[1,1,"CD",2,{"$f":"_4B1a+_4B1b*1+_4B1c*1+_4B1d*0+_4B1e*(-1)+_4B1f*LFH+_4B1g*Slope","v":7.8543080700000001},3.8792595614934542E-4]
[1,2,"B",3,{"$f":"_4B1a+_4B1b*1+_4B1c*0+_4B1d*1+_4B1e*1+_4B1f*LFH+_4B1g*Slope","v":2.9376246999999998},5.032467258842032E-2]
[1,2,"CD",4,{"$f":"_4B1a+_4B1b*1+_4B1c*0+_4B1d*1+_4B1e*(-1)+_4B1f*LFH+_4B1g*Slope","v":4.7817517000000009},8.3116421654803301E-3]
[1,3,"B",5,{"$f":"_4B1a+_4B1b*1+_4B1c*(-1)+_4B1d*(-1)+_4B1e*1+_4B1f*LFH+_4B1g*Slope","v":3.1237715299999991},4.2137283213606803E-2]
[1,3,"CD",6,{"$f":"_4B1a+_4B1b*1+_4B1c*(-1)+_4B1d*(-1)+_4B1e*(-1)+_4B1f*LFH+_4B1g*Slope","v":4.9678985299999994},6.9096783503535325E-3]
[2,1,"B",7,{"$f":"_4B1a+_4B1b*(-1)+_4B1c*1+_4B1d*0+_4B1e*1+_4B1f*LFH+_4B1g*Slope","v":4.0521725299999991},1.708750622963259E-2]
[2,1,"CD",8,{"$f":"_4B1a+_4B1b*(-1)+_4B1c*1+_4B1d*0+_4B1e*(-1)+_4B1f*LFH+_4B1g*Slope","v":5.8962995300000003},2.742061257643741E-3]
[2,2,"B",9,{"$f":"_4B1a+_4B1b*(-1)+_4B1c*0+_4B1d*1+_4B1e*1+_4B1f*LFH+_4B1g*Slope","v":0.97961615999999974},0.27296795254382383]
[2,2,"CD",10,{"$f":"_4B1a+_4B1b*(-1)+_4B1c*0+_4B1d*1+_4B1e*(-1)+_4B1f*LFH+_4B1g*Slope","v":2.8237431600000003},5.6054544429132873E-2]
[2,3,"B",11,{"$f":"_4B1a+_4B1b*(-1)+_4B1c*(-1)+_4B1d*(-1)+_4B1e*1+_4B1f*LFH+_4B1g*Slope","v":1.1657629899999995},0.23762169744589773]
[2,3,"CD",12,{"$f":"_4B1a+_4B1b*(-1)+_4B1c*(-1)+_4B1d*(-1)+_4B1e*(-1)+_4B1f*LFH+_4B1g*Slope","v":3.0098899899999996},4.698107100405239E-2]
["4B2","Stocking probability index of white  spruce / balsam fir (30cm+)"]
["Model spinSW","Transformation: spinSW = ((1 + eY)-1)"]
["Intercept","4B2a",54.431161500000002]
["SNCd[BC]","4B2b",0.67746408000000002]
["NSR[LF]","4B2c",-0.46565269999999997]
["SMCb[MesicDry]","4B2d",0.53133368999999997]
["spinAW","4B2e",1.3629877500000001]
["Lat","4B2f",-0.96664709999999998]
["SNCd","NSR","SMCb","Index","Y","spinSW"]
[{"$f":"SNCd","v":"BC"},{"$f":"NSR","v":2},{"$f":"SMCb","v":"MesicDry"},{"$f":"INDEX(A214:D221,MATCH(A213&B213&C213,A214:A221&B214:B221&C214:C221,0),4)","v":3},{"$f":"LOOKUP(D213,D214:D221,E214:E221)","v":4.4225635184374994},{"$f":"((1+EXP(E213))^-1)","v":1.1861048646757598E-2}]
["BC",1,"MesicDry",1,{"$f":"_4B2a+_4B2b*1+_4B2c*1+_4B2d*1+_4B2e*spinAW+_4B2f*Lat","v":3.4912581184375},2.9561989808426618E-2]
["BC",1,"Moist",2,{"$f":"_4B2a+_4B2b*1+_4B2c*1+_4B2d*(-1)+_4B2e*spinAW+_4B2f*Lat","v":2.4285907384375065},8.1018330949936254E-2]
["BC",2,"MesicDry",3,{"$f":"_4B2a+_4B2b*1+_4B2c*(-1)+_4B2d*1+_4B2e*spinAW+_4B2f*Lat","v":4.4225635184374994},1.1861048646757598E-2]
["BC",2,"Moist",4,{"$f":"_4B2a+_4B2b*1+_4B2c*(-1)+_4B2d*(-1)+_4B2e*spinAW+_4B2f*Lat","v":3.3598961384375059},3.3572592955860542E-2]
["D",1,"MesicDry",5,{"$f":"_4B2a+_4B2b*(-1)+_4B2c*1+_4B2d*1+_4B2e*spinAW+_4B2f*Lat","v":2.1363299584375},0.10561556356797475]
["D",1,"Moist",6,{"$f":"_4B2a+_4B2b*(-1)+_4B2c*1+_4B2d*(-1)+_4B2e*spinAW+_4B2f*Lat","v":1.0736625784375065},0.25470718722946922]
["D",2,"MesicDry",7,{"$f":"_4B2a+_4B2b*(-1)+_4B2c*(-1)+_4B2d*1+_4B2e*spinAW+_4B2f*Lat","v":3.0676353584374993},4.4462181939794884E-2]
["D",2,"Moist",8,{"$f":"_4B2a+_4B2b*(-1)+_4B2c*(-1)+_4B2d*(-1)+_4B2e*spinAW+_4B2f*Lat","v":2.0049679784375058},0.11868230212891126]
["4B3","Stocking probability of black spruce (1.3m+) at handover (unthinned stands only)"]
["sSB","Transformation: sSB = ((1 + eY)-1)"]
["Intercept","4B3a",50.807020999999999]
["SNCb[B]","4B3b",-0.76371029999999995]
["PrepB[MSP]","4B3c",-0.71157840000000006]
["Lat","4B3d",-0.80908530000000001]
["YSC","4B3e",-0.234843]
["LFH","4B3f",-4.1957700000000001E-2]
["SNCb","PrepB","Index","Y","sSB","psSBhand"]
[{"$f":"SNCb","v":"CD"},{"$f":"PrepB","v":"MSP"},{"$f":"INDEX(A232:C235,MATCH(A231&B231,A232:A235&B232:B235,0),3)","v":3},{"$f":"LOOKUP(C231,C232:C235,D232:D235)","v":2.0871843499999967},{"$f":"((1+EXP(D231))^-1)","v":0.11034868883442488},{"$f":"E231*100","v":11.034868883442488}]
["B","MSP",1,{"$f":"_4B3a+_4B3b*1+_4B3c*1+_4B3d*Lat+_4B3e*YSChand+_4B3f*LFH","v":0.55976374999999745},0.36360212517180468,{"$f":"E232*100","v":36.360212517180472}]
["B","None",2,{"$f":"_4B3a+_4B3b*1+_4B3c*(-1)+_4B3d*Lat+_4B3e*YSChand+_4B3f*LFH","v":1.9829205499999984},0.12100784973588544,12.100784973588544]
["CD","MSP",3,{"$f":"_4B3a+_4B3b*(-1)+_4B3c*1+_4B3d*Lat+_4B3e*YSChand+_4B3f*LFH","v":2.0871843499999967},0.11034868883442488,11.034868883442488]
["CD","None",4,{"$f":"_4B3a+_4B3b*(-1)+_4B3c*(-1)+_4B3d*Lat+_4B3e*YSChand+_4B3f*LFH","v":3.5103411499999977},2.9019421607554417E-2,2.9019421607554419]
["4B4","Stocking probability of black spruce (1.3m+) at handover (augmented, unthinned stands only)"]
["sSB","Transformation: sSB = ((1 + eY)-1)"]
["Intercept","4B4a",58.974877499999998]
["SNCb[B]","4B4b",-0.5109321]
["PrepB[MSP]","4B4c",-0.64948640000000002]
["Lat","4B4d",-0.95293539999999999]
["YSC","4B4e",-0.25722800000000001]
["LFH","4B4f",-2.3581700000000001E-2]
["spinSB","4B4g",-2.9717775999999998]
["SNCb","PrepB","Index","Y","sSB","psSBhand"]
[{"$f":"SNCb","v":"CD"},{"$f":"PrepB","v":"MSP"},{"$f":"INDEX(A247:C250,MATCH(A246&B246,A247:A250&B247:B250,0),3)","v":3},{"$f":"LOOKUP(C246,C247:C250,D247:D250)","v":2.3501426604872928},{"$f":"((1+EXP(D246))^-1)","v":8.7054433693236205E-2},{"$f":"E246*100","v":8.7054433693236213}]
["B","MSP",1,{"$f":"_4B4a+_4B4b*1+_4B4c*1+_4B4d*Lat+_4B4e*YSChand+_4B4f*LFH+_4B4g*spinSB","v":1.3282784604872966},0.20944427061374404,{"$f":"E247*100","v":20.944427061374405}]
["B","None",2,{"$f":"_4B4a+_4B4b*1+_4B4c*(-1)+_4B4d*Lat+_4B4e*YSChand+_4B4f*LFH+_4B4g*spinSB","v":2.6272512604872982},6.7405035414591322E-2,6.7405035414591321]
["CD","MSP",3,{"$f":"_4B4a+_4B4b*(-1)+_4B4c*1+_4B4d*Lat+_4B4e*YSChand+_4B4f*LFH+_4B4g*spinSB","v":2.3501426604872928},8.7054433693236205E-2,8.7054433693236213]
["CD","None",4,{"$f":"_4B4a+_4B4b*(-1)+_4B4c*(-1)+_4B4d*Lat+_4B4e*YSChand+_4B4f*LFH+_4B4g*spinSB","v":3.6491154604872942},2.5354552526541264E-2,2.5354552526541263]
["4B5","Stocking probability of white spruce / balsam fir (1.3m+) at handover (unthinned stands)"]
["sSW","Transformation: sSW = ((1 + eY)-1)"]
["Intercept","4B5a",6.18655461]
["YSC","4B5b",-0.1550561]
["denPLp","4B5c",2.4224000000000001E-4]
["Weed[No]","4B5d",0.29578885999999999]
["SNCd[BC]","4B5e",0.43848945]
["spinSW","4B5f",-6.6540913000000002]
["Weed","SNCd","Index","Y","sSWhand","psSWhand"]
[{"$f":"Weed","v":true},{"$f":"SNCd","v":"BC"},{"$f":"INDEX(A261:C264,MATCH(A260&B260,A261:A264&B261:B264,0),3)","v":3},{"$f":"LOOKUP(C260,C261:C264,D261:D264)","v":3.527306450088743},{"$f":"((1+EXP(D260))^-1)","v":2.8545186017877908E-2},{"$f":"E260*100","v":2.8545186017877908}]
[false,"BC",1,{"$f":"_4B5a+_4B5b*YSChand+_4B5c*denPLpHandB+_4B5d*1+_4B5e*1+_4B5f*spinSW","v":4.1188841700887426},{"$f":"((1+EXP(D261))^-1)","v":1.6002409084768753E-2},{"$f":"E261*100","v":1.6002409084768754}]
[false,"D",2,{"$f":"_4B5a+_4B5b*YSChand+_4B5c*denPLpHandB+_4B5d*1+_4B5e*(-1)+_4B5f*spinSW","v":3.241905270088743},{"$f":"((1+EXP(D262))^-1)","v":3.7618851932192908E-2},{"$f":"E262*100","v":3.7618851932192907}]
[true,"BC",3,{"$f":"_4B5a+_4B5b*YSChand+_4B5c*denPLpHandB+_4B5d*(-1)+_4B5e*1+_4B5f*spinSW","v":3.527306450088743},2.8545186017877908E-2,2.8545186017877908]
[true,"D",4,{"$f":"_4B5a+_4B5b*YSChand+_4B5c*denPLpHandB+_4B5d*(-1)+_4B5e*(-1)+_4B5f*spinSW","v":2.6503275500887429},6.5968823988096073E-2,6.5968823988096075]
["4B6","Trees per stocked plot (1.3m+) of black spruce at handover (unthinned stands only)"]
["LNtpspSB","Transformation: tpspSB = EXP(LNtpspSB)"]
["Intercept","4B6a",-0.57050000000000001]
["LNpsSB13","4B6b",0.35048810000000002]
["psSBhand","LNpsSBhand","LNtpspSB","tpspSB"]
[{"$f":"psSBhand","v":11.034868883442488},{"$f":"LN(psSBhand)","v":2.4010601577570485},{"$f":"_4B6a+_4B6b*B270","v":0.27104301267796826},{"$f":"IF(EXP(C270)<1,1,EXP(C270))","v":1.3113314730499244},null,null,null,null,null,null,null,null,null,null,null,null,"Cannot be <1"]
["4B7","Trees per stocked plot (1.3m+) of white spruce / balsam fir at handover (unthinned stands only)"]
["LNtpspSW","Transformation: tpspSW = EXP(LNtpspSW)"]
["Intercept","4B7a",-0.39585799999999999]
["LNpsSW13","4B7b",0.25744099999999998]
["psSWhand","LNpsSWhand","LNtpspSW","tpspSW"]
[{"$f":"psSWhand","v":2.8545186017877908},{"$f":"LN(psSWhand)","v":1.048903213054575},{"$f":"_4B7a+_4B7b*B276","v":-0.12582730792801716},{"$f":"IF(EXP(C276)<1,1,EXP(C276))","v":1},null,null,null,null,null,null,null,null,null,null,null,null,"Cannot be <1"]
["5A1","Quadratic mean diameter of unthinned planted pine at handover "]
["dbhPLpB"]
["Intercept","v5A1a",-29.69763]
["LNtophtPLpHand","v5A1b",7.6257700000000002]
["LNnP","v5A1c",-1.4112530000000001]
["spinAw125","v5A1d",-4.2979859999999999]
["denPLn","v5A1e",-7.7000000000000001E-5]
[null,null,"dbhPLpB","dbhPLpB"]
[null,null,{"$f":"v5A1a+v5A1b*LNtophtPLpHand+v5A1c*LNnP+v5A1d*spinAW125Less+v5A1e*denPLnHandB","v":11.385017997026361},{"$f":"IF(C285<0,0,C285)","v":11.385017997026361}]
["5A2","Quadratic mean diameter of thinned planted pine at handover "]
["dbhPLpA"]
["Intercept","v5A2a",1.3391976999999999]
["tophtPLpHand","v5A2b",1.4207300000000001E-2]
["LNdenPLpHandAless6","v5A2c",-1.4510860000000001,null,null,null,null,null,null,null,null,null,null,null,null,null,"LNdenPLpHandAless6 replaces LNnP"]
["spinAw8125","v5A2d",-12.6858]
[null,null,null,"dbhPLpA","dbhPLpA"]
[null,null,null,{"$f":"v5A2a+v5A2b*tophtPLpHand+v5A2c*LNdenPLpHandAless6+v5A2d*spinAW8125Less","v":11.228892957037148},{"$f":"IF(D293<0,0,D293)","v":11.228892957037148},null,null,null,null,null,null,null,null,null,null,null,"Cannot be less than zero or non-thinned DBH"]
["5A3","Quadratic mean diameter of unthinned pine natural regeneration at handover "]
["LNdbhPLn","Transformation: dbhPLn =exp(LNdbhPLn)"]
["Intercept","5A3a",0.37115330000000002]
["SNC[B]","5A3b",-0.232183]
["SNC[C]","5A3c",4.3925699999999998E-2]
["SMCb[MesicDry]","5A3d",5.6775300000000001E-2]
["denPLnHandB","5A3e",-1.9000000000000001E-5]
["denAWhandB","5A3f",-5.1E-5]
["nP","5A3g",-9.1000000000000003E-5]
["YSChand","5A3h",8.1216899999999995E-2]
["Elev","5A3i",-1.6699999999999999E-4]
["SNC","SMCb","Index","dbhPLnB","dbhPLnB"]
[{"$f":"SNC","v":2},{"$f":"SMCb","v":"MesicDry"},{"$f":"INDEX(A307:D312,MATCH(A306&B306,A307:A312&B307:B312,0),3)","v":3},{"$f":"LOOKUP(C306,C307:C312,D307:D312)","v":4.6008976809495579},{"$f":"IF(D306<0,0,D306)","v":4.6008976809495579},null,null,null,null,null,null,null,null,null,null,null,"Cannot be less than zero"]
[1,"MesicDry",1,{"$f":"EXP(_5A3a+_5A3b*1+_5A3c*0+_5A3d*1+_5A3e*denPLnHandB+_5A3f*denAWhandB+_5A3g*nP+_5A3h*(YSChand-1)+_5A3i*Elev)","v":3.4908411783537505},null,null,null,null,null,null,null,null,null,null,null,null,"YSC-1 used to allow for variable regeneration delay"]
[1,"Moist",2,{"$f":"EXP(_5A3a+_5A3b*1+_5A3c*0+_5A3d*(-1)+_5A3e*denPLnHandB+_5A3f*denAWhandB+_5A3g*nP+_5A3h*(YSChand-1)+_5A3i*Elev)","v":3.1161308887091148},null,null,null,null,null,null,null,null,null,null,null,null,"YSC-1 used to allow for variable regeneration delay"]
[2,"MesicDry",3,{"$f":"EXP(_5A3a+_5A3b*0+_5A3c*1+_5A3d*1+_5A3e*denPLnHandB+_5A3f*denAWhandB+_5A3g*nP+_5A3h*(YSChand-1)+_5A3i*Elev)","v":4.6008976809495579},null,null,null,null,null,null,null,null,null,null,null,null,"YSC-1 used to allow for variable regeneration delay"]
[2,"Moist",4,{"$f":"EXP(_5A3a+_5A3b*0+_5A3c*1+_5A3d*(-1)+_5A3e*denPLnHandB+_5A3f*denAWhandB+_5A3g*nP+_5A3h*(YSChand-1)+_5A3i*Elev)","v":4.1070328459223271},null,null,null,null,null,null,null,null,null,null,null,null,"YSC-1 used to allow for variable regeneration delay"]
[3,"MesicDry",5,{"$f":"EXP(_5A3a+_5A3b*(-1)+_5A3c*(-1)+_5A3d*1+_5A3e*denPLnHandB+_5A3f*denAWhandB+_5A3g*nP+_5A3h*(YSChand-1)+_5A3i*Elev)","v":5.3152658666419601},null,null,null,null,null,null,null,null,null,null,null,null,"YSC-1 used to allow for variable regeneration delay"]
[3,"Moist",6,{"$f":"EXP(_5A3a+_5A3b*(-1)+_5A3c*(-1)+_5A3d*(-1)+_5A3e*denPLnHandB+_5A3f*denAWhandB+_5A3g*nP+_5A3h*(YSChand-1)+_5A3i*Elev)","v":4.744720055283417},null,null,null,null,null,null,null,null,null,null,null,null,"YSC-1 used to allow for variable regeneration delay"]
["5A4","Quadratic mean diameter of thinned pine natural regeneration at handover "]
["LNdbhPLn","Transformation: dbhPLn =exp(LNdbhPLn)"]
["Intercept","5A4a",1.5474707999999999]
["SNC[B]","5A4b",-0.208621]
["SNC[C]","5A4c",9.0351500000000001E-2]
["SMCb[MesicDry]","5A4d",7.2628799999999993E-2]
["denPLnHandA","5A4e",-3.3000000000000003E-5]
["denAWhandA2000Less","5A4f",-1.66E-4]
["nP750Less","5A4g",-1.3300000000000001E-4]
["GST","5A4h",7.6059100000000004E-2]
["SNC","SMCb","Index","dbhPLnA","dbhPLnA"]
[{"$f":"SNC","v":2},{"$f":"SMCb","v":"MesicDry"},{"$f":"INDEX(A325:D330,MATCH(A324&B324,A325:A330&B325:B330,0),3)","v":3},{"$f":"LOOKUP(C324,C325:C330,D325:D330)","v":15.311423317649721},{"$f":"IF(D324<0,0,D324)","v":15.311423317649721},null,null,null,null,null,null,null,null,null,null,null,"Cannot be less than zero or non-thinned DBH"]
[1,"MesicDry",1,{"$f":"EXP(_5A4a+_5A4b*1+_5A4c*0+_5A4d*1+_5A4e*denPLnHandA+_5A4f*denAWhandA2000Less+_5A4g*nP750Less+_5A4h*(IntThinHand-1))","v":11.35464228141508},null,null,null,null,null,null,null,null,null,null,null,null,"IntThinHand-1 used to allow for variable regeneration delay"]
[1,"Moist",2,{"$f":"EXP(_5A4a+_5A4b*1+_5A4c*0+_5A4d*(-1)+_5A4e*denPLnHandA+_5A4f*denAWhandA2000Less+_5A4g*nP750Less+_5A4h*(IntThinHand-1))","v":9.8194888775593725},null,null,null,null,null,null,null,null,null,null,null,null,"IntThinHand-1 used to allow for variable regeneration delay"]
[2,"MesicDry",3,{"$f":"EXP(_5A4a+_5A4b*0+_5A4c*1+_5A4d*1+_5A4e*denPLnHandA+_5A4f*denAWhandA2000Less+_5A4g*nP750Less+_5A4h*(IntThinHand-1))","v":15.311423317649721},null,null,null,null,null,null,null,null,null,null,null,null,"IntThinHand-1 used to allow for variable regeneration delay"]
[2,"Moist",4,{"$f":"EXP(_5A4a+_5A4b*0+_5A4c*1+_5A4d*(-1)+_5A4e*denPLnHandA+_5A4f*denAWhandA2000Less+_5A4g*nP750Less+_5A4h*(IntThinHand-1))","v":13.241311107911642},null,null,null,null,null,null,null,null,null,null,null,null,"IntThinHand-1 used to allow for variable regeneration delay"]
[3,"MesicDry",5,{"$f":"EXP(_5A4a+_5A4b*(-1)+_5A4c*(-1)+_5A4d*1+_5A4e*denPLnHandA+_5A4f*denAWhandA2000Less+_5A4g*nP750Less+_5A4h*(IntThinHand-1))","v":15.744910526621528},null,null,null,null,null,null,null,null,null,null,null,null,"IntThinHand-1 used to allow for variable regeneration delay"]
[3,"Moist",6,{"$f":"EXP(_5A4a+_5A4b*(-1)+_5A4c*(-1)+_5A4d*(-1)+_5A4e*denPLnHandA+_5A4f*denAWhandA2000Less+_5A4g*nP750Less+_5A4h*(IntThinHand-1))","v":13.616190626047585},null,null,null,null,null,null,null,null,null,null,null,null,"IntThinHand-1 used to allow for variable regeneration delay"]
["5B1","Quadratic mean diameter of unthinned aspen / poplar at handover "]
["dbhAW"]
["Intercept","v5B1a",-8.2012990000000006]
["LNtophtAWhandB","v5B1b",1.7022923999999999]
["spinAW","v5B1c",3.5640757000000001]
["denAWhandB","v5B1d",-1.6100000000000001E-4]
[null,"dbhAWb","dbhAWb"]
[null,{"$f":"v5B1a+v5B1b*LN(tophtAWhandB)+v5B1c*spinAW+v5B1d*denAWhandB","v":2.3498286923370197},{"$f":"IF(B338<0,0,B338)","v":2.3498286923370197}]
["5B2","Quadratic mean diameter of thinned aspen / poplar at handover "]
["dbhAW"]
["Intercept","v5B2a",-6.4449420000000002]
["LNtophtAWhandA","v5B2b",1.277585]
[null,"dbhAWa","dbhAWa"]
[null,{"$f":"v5B2a+v5B2b*LN(tophtAWhandA)","v":1.7177960447884795},{"$f":"IF(B344<0,0,B344)","v":1.7177960447884795}]
["6A1","Total age of naturally regenerated pine in unthinned unplanted (leave for natural) stands"]
["agePL"]
["Intercept","6A1a",-5.2449880000000002]
["YSC","6A1b",0.95237229999999995]
["LN1denPLn","6A1c",0.48313519999999999]
["SMC[Dry]","6A1d",-0.43180200000000002]
["SMC[Mesic]","6A1e",0.63183020000000001]
["SMC","agePLperfB","agePLhandB","agePLthinB"]
[{"$f":"SMC","v":2},{"$f":"IF(SMC=1,B354,IF(SMC=2,B355,B356))","v":-0.25212440665708913},{"$f":"IF(SMC=1,C354,IF(SMC=2,C355,C356))","v":16.633557375230087},{"$f":"IF(SMC=1,D354,IF(SMC=2,D355,D356))","v":1.6526201933429108}]
[1,{"$f":"_6A1a+_6A1b*YSCperf+_6A1c*LN1denPLnPerfB+_6A1d*1+_6A1e*0","v":-1.3157566066570892},{"$f":"_6A1a+_6A1b*YSChand+_6A1c*LN1denPLnHandB+_6A1d*1+_6A1e*0","v":15.569925175230088},{"$f":"_6A1a+_6A1b*YSCthin+_6A1c*LN1denPLnThinB+_6A1d*1+_6A1e*0","v":0.58898799334291074}]
[2,{"$f":"_6A1a+_6A1b*YSCperf+_6A1c*LN1denPLnPerfB+_6A1d*0+_6A1e*1","v":-0.25212440665708913},{"$f":"_6A1a+_6A1b*YSChand+_6A1c*LN1denPLnHandB+_6A1d*0+_6A1e*1","v":16.633557375230087},{"$f":"_6A1a+_6A1b*YSCthin+_6A1c*LN1denPLnThinB+_6A1d*0+_6A1e*1","v":1.6526201933429108}]
[3,{"$f":"_6A1a+_6A1b*YSCperf+_6A1c*LN1denPLnPerfB+_6A1d*(-1)+_6A1e*(-1)","v":-1.0839828066570891},{"$f":"_6A1a+_6A1b*YSChand+_6A1c*LN1denPLnHandB+_6A1d*(-1)+_6A1e*(-1)","v":15.801698975230089},{"$f":"_6A1a+_6A1b*YSCthin+_6A1c*LN1denPLnThinB+_6A1d*(-1)+_6A1e*(-1)","v":0.82076179334291077}]
["6A2","Total age of naturally regenerated pine in thinned unplanted (leave for natural) stands"]
["agePLn"]
["Intercept","6A2a",-7.2900029999999996]
["YSC","6A2b",0.91815939999999996]
["LN1denPL","6A2c",0.87339650000000002]
["SMC[Dry]","6A2d",-0.96614]
["SMC[Mesic]","6A2e",0.6907664]
["SMC","agePLnPerfA","agePLnHandA","agePLnThinA"]
[{"$f":"SMC","v":2},{"$f":"IF(SMC=1,B366,IF(SMC=2,B367,B368))","v":0.96565841617601023},{"$f":"IF(SMC=1,C366,IF(SMC=2,C367,C368))","v":17.108324840824626},{"$f":"IF(SMC=1,D366,IF(SMC=2,D367,D368))","v":2.8019772161760104}]
[1,{"$f":"_6A2a+_6A2b*YSCperf+_6A2c*LN1denPLnPerfA+_6A2d*1+_6A2e*0","v":-0.69124798382398978},{"$f":"_6A2a+_6A2b*YSChand+_6A2c*LN1denPLnHandA+_6A2d*1+_6A2e*0","v":15.451418440824625},{"$f":"_6A2a+_6A2b*YSCthin+_6A2c*LN1denPLnThinA+_6A2d*1+_6A2e*0","v":1.1450708161760101}]
[2,{"$f":"_6A2a+_6A2b*YSCperf+_6A2c*LN1denPLnPerfA+_6A2d*0+_6A2e*1","v":0.96565841617601023},{"$f":"_6A2a+_6A2b*YSChand+_6A2c*LN1denPLnHandA+_6A2d*0+_6A2e*1","v":17.108324840824626},{"$f":"_6A2a+_6A2b*YSCthin+_6A2c*LN1denPLnThinA+_6A2d*0+_6A2e*1","v":2.8019772161760104}]
[3,{"$f":"_6A2a+_6A2b*YSCperf+_6A2c*LN1denPLnPerfA+_6A2d*(-1)+_6A2e*(-1)","v":0.55026561617601022},{"$f":"_6A2a+_6A2b*YSChand+_6A2c*LN1denPLnHandA+_6A1d*(-1)+_6A2e*(-1)","v":16.158594040824624},{"$f":"_6A2a+_6A2b*YSCthin+_6A2c*LN1denPLnThinA+_6A2d*(-1)+_6A2e*(-1)","v":2.3865844161760101}]
["6A3a (After)","Top height of pine in unplanted (leave for natural) stands after thinning"]
["tophtPL"]
["Intercept","6A3a",146.86931000000001]
["agePLn","6A3b",44.885832000000001]
["SMCb[MesicDry]","6A3c",32.604725000000002]
["Elev","6A3d",-0.23086599999999999]
["SNC[B]","6A3e",-55.252470000000002]
["SNC[C]","6A3f",3.5358922000000002]
["spinAW","6A3g",-108.1649]
["SMCb","SNC","Index","tophtPLperfLfnA","tophtPLhandLfnA","tophtPLthinLfnA"]
[{"$f":"SMCb","v":"MesicDry"},{"$f":"SNC","v":2},{"$f":"INDEX(A380:C385,MATCH(A379&B379,A380:A385&B380:B385,0),3)","v":2},{"$f":"LOOKUP(C379,C380:C385,D380:D385)*tophtPLadj","v":-88.920906340078659},{"$f":"LOOKUP(C379,C380:C385,E380:E385)*tophtPLadj","v":635.65610682873978},{"$f":"LOOKUP(C379,C380:C385,F380:F385)*tophtPLadj","v":-6.4962091848370953},null,null,null,null,null,null,null,null,null,null,"Top height adjusted by SNC"]
["MesicDry",1,1,{"$f":"_6A3a+_6A3b*(agePLnPerfA-1)+_6A3c*1+_6A3d*Elev+_6A3e*1+_6A3f*0+_6A3g*spinAW","v":-147.70926854007868},{"$f":"_6A3a+_6A3b*(agePLnHandA-1)+_6A3c*1+_6A3d*Elev+_6A3e*1+_6A3f*0+_6A3g*spinAW","v":576.86774462873973},{"$f":"_6A3a+_6A3b*(agePLnThinA-1)+_6A3c*1+_6A3d*Elev+_6A3e*1+_6A3f*0+_6A3g*spinAW","v":-65.284571384837093},null,null,null,null,null,null,null,null,null,null,"Reduced age by 1 year to simulate extended regeneration delay"]
["MesicDry",2,2,{"$f":"_6A3a+_6A3b*(agePLnPerfA-1)+_6A3c*1+_6A3d*Elev+_6A3e*0+_6A3f*1+_6A3g*spinAW","v":-88.920906340078659},{"$f":"_6A3a+_6A3b*(agePLnHandA-1)+_6A3c*1+_6A3d*Elev+_6A3e*0+_6A3f*1+_6A3g*spinAW","v":635.65610682873978},{"$f":"_6A3a+_6A3b*(agePLnThinA-1)+_6A3c*1+_6A3d*Elev+_6A3e*0+_6A3f*1+_6A3g*spinAW","v":-6.4962091848370953},null,null,null,null,null,null,null,null,null,null,"Reduced age by 1 year to simulate extended regeneration delay"]
["MesicDry",3,3,{"$f":"_6A3a+_6A3b*(agePLnPerfA-1)+_6A3c*1+_6A3d*Elev+_6A3e*(-1)+_6A3f*(-1)+_6A3g*spinAW","v":-40.740220740078669},{"$f":"_6A3a+_6A3b*(agePLnHandA-1)+_6A3c*1+_6A3d*Elev+_6A3e*(-1)+_6A3f*(-1)+_6A3g*spinAW","v":683.83679242873973},{"$f":"_6A3a+_6A3b*(agePLnThinA-1)+_6A3c*1+_6A3d*Elev+_6A3e*(-1)+_6A3f*(-1)+_6A3g*spinAW","v":41.684476415162905},null,null,null,null,null,null,null,null,null,null,"Reduced age by 1 year to simulate extended regeneration delay"]
["Moist",1,4,{"$f":"_6A3a+_6A3b*(agePLnPerfA-1)+_6A3c*(-1)+_6A3d*Elev+_6A3e*1+_6A3f*0+_6A3g*spinAW","v":-212.91871854007869},{"$f":"_6A3a+_6A3b*(agePLnHandA-1)+_6A3c*(-1)+_6A3d*Elev+_6A3e*1+_6A3f*0+_6A3g*spinAW","v":511.65829462873961},{"$f":"_6A3a+_6A3b*(agePLnThinA-1)+_6A3c*(-1)+_6A3d*Elev+_6A3e*1+_6A3f*0+_6A3g*spinAW","v":-130.49402138483708},null,null,null,null,null,null,null,null,null,null,"Reduced age by 1 year to simulate extended regeneration delay"]
["Moist",2,5,{"$f":"_6A3a+_6A3b*(agePLnPerfA-1)+_6A3c*(-1)+_6A3d*Elev+_6A3e*0+_6A3f*1+_6A3g*spinAW","v":-154.13035634007866},{"$f":"_6A3a+_6A3b*(agePLnHandA-1)+_6A3c*(-1)+_6A3d*Elev+_6A3e*0+_6A3f*1+_6A3g*spinAW","v":570.44665682873972},{"$f":"_6A3a+_6A3b*(agePLnThinA-1)+_6A3c*(-1)+_6A3d*Elev+_6A3e*0+_6A3f*1+_6A3g*spinAW","v":-71.70565918483706},null,null,null,null,null,null,null,null,null,null,"Reduced age by 1 year to simulate extended regeneration delay"]
["Moist",3,6,{"$f":"_6A3a+_6A3b*(agePLnPerfA-1)+_6A3c*(-1)+_6A3d*Elev+_6A3e*(-1)+_6A3f*(-1)+_6A3g*spinAW","v":-105.94967074007867},{"$f":"_6A3a+_6A3b*(agePLnHandA-1)+_6A3c*(-1)+_6A3d*Elev+_6A3e*(-1)+_6A3f*(-1)+_6A3g*spinAW","v":618.62734242873967},{"$f":"_6A3a+_6A3b*(agePLnThinA-1)+_6A3c*(-1)+_6A3d*Elev+_6A3e*(-1)+_6A3f*(-1)+_6A3g*spinAW","v":-23.524973584837067},null,null,null,null,null,null,null,null,null,null,"Reduced age by 1 year to simulate extended regeneration delay"]
["6A3b (Before)","Top height of pine in unplanted (leave for natural) stands before thinning"]
["tophtPL"]
["Intercept","6A3a",146.86931000000001,"Not read, same as 6A3 (after)"]
["agePLn","6A3b",44.885832000000001,"Not read, same as 6A3 (after)"]
["SMCb[MesicDry]","6A3c",32.604725000000002,"Not read, same as 6A3 (after)"]
["Elev","6A3d",-0.23086599999999999,"Not read, same as 6A3 (after)"]
["SNC[B]","6A3e",-55.252470000000002,"Not read, same as 6A3 (after)"]
["SNC[C]","6A3f",3.5358922000000002,"Not read, same as 6A3 (after)"]
["spinAW","6A3g",-108.1649,"Not read, same as 6A3 (after)"]
["SMCb","SNC","Index","tophtPLperfLfnB","tophtPLhandLfnB","tophtPLthinLfnB"]
[{"$f":"SMCb","v":"MesicDry"},{"$f":"SNC","v":2},{"$f":"INDEX(A397:C402,MATCH(A396&B396,A397:A402&B397:B402,0),3)","v":2},{"$f":"LOOKUP(C396,C397:C402,D397:D402)*tophtPLadj","v":-143.58210153825092},{"$f":"LOOKUP(C396,C397:C402,E397:E402)*tophtPLadj","v":614.34577412899773},{"$f":"LOOKUP(C396,C397:C402,F397:F402)*tophtPLadj","v":-58.086055419743744},null,null,null,null,null,null,null,null,null,null,"Top height adjusted by SNC"]
["MesicDry",1,1,{"$f":"_6A3a+_6A3b*(agePLnPerfB-1)+_6A3c*1+_6A3d*Elev+_6A3e*1+_6A3f*0+_6A3g*spinAW","v":-202.37046373825095},{"$f":"_6A3a+_6A3b*(agePLnHandB-1)+_6A3c*1+_6A3d*Elev+_6A3e*1+_6A3f*0+_6A3g*spinAW","v":555.55741192899768},{"$f":"_6A3a+_6A3b*(agePLnThinB-1)+_6A3c*1+_6A3d*Elev+_6A3e*1+_6A3f*0+_6A3g*spinAW","v":-116.87441761974374},null,null,null,null,null,null,null,null,null,null,"Reduced age by 1 year to simulate extended regeneration delay"]
["MesicDry",2,2,{"$f":"_6A3a+_6A3b*(agePLnPerfB-1)+_6A3c*1+_6A3d*Elev+_6A3e*0+_6A3f*1+_6A3g*spinAW","v":-143.58210153825092},{"$f":"_6A3a+_6A3b*(agePLnHandB-1)+_6A3c*1+_6A3d*Elev+_6A3e*0+_6A3f*1+_6A3g*spinAW","v":614.34577412899773},{"$f":"_6A3a+_6A3b*(agePLnThinB-1)+_6A3c*1+_6A3d*Elev+_6A3e*0+_6A3f*1+_6A3g*spinAW","v":-58.086055419743744},null,null,null,null,null,null,null,null,null,null,"Reduced age by 1 year to simulate extended regeneration delay"]
["MesicDry",3,3,{"$f":"_6A3a+_6A3b*(agePLnPerfB-1)+_6A3c*1+_6A3d*Elev+_6A3e*(-1)+_6A3f*(-1)+_6A3g*spinAW","v":-95.401415938250935},{"$f":"_6A3a+_6A3b*(agePLnHandB-1)+_6A3c*1+_6A3d*Elev+_6A3e*(-1)+_6A3f*(-1)+_6A3g*spinAW","v":662.52645972899768},{"$f":"_6A3a+_6A3b*(agePLnThinB-1)+_6A3c*1+_6A3d*Elev+_6A3e*(-1)+_6A3f*(-1)+_6A3g*spinAW","v":-9.9053698197437381},null,null,null,null,null,null,null,null,null,null,"Reduced age by 1 year to simulate extended regeneration delay"]
["Moist",1,4,{"$f":"_6A3a+_6A3b*(agePLnPerfB-1)+_6A3c*(-1)+_6A3d*Elev+_6A3e*1+_6A3f*0+_6A3g*spinAW","v":-267.57991373825098},{"$f":"_6A3a+_6A3b*(agePLnHandB-1)+_6A3c*(-1)+_6A3d*Elev+_6A3e*1+_6A3f*0+_6A3g*spinAW","v":490.34796192899756},{"$f":"_6A3a+_6A3b*(agePLnThinB-1)+_6A3c*(-1)+_6A3d*Elev+_6A3e*1+_6A3f*0+_6A3g*spinAW","v":-182.08386761974376},null,null,null,null,null,null,null,null,null,null,"Reduced age by 1 year to simulate extended regeneration delay"]
["Moist",2,5,{"$f":"_6A3a+_6A3b*(agePLnPerfB-1)+_6A3c*(-1)+_6A3d*Elev+_6A3e*0+_6A3f*1+_6A3g*spinAW","v":-208.79155153825093},{"$f":"_6A3a+_6A3b*(agePLnHandB-1)+_6A3c*(-1)+_6A3d*Elev+_6A3e*0+_6A3f*1+_6A3g*spinAW","v":549.13632412899767},{"$f":"_6A3a+_6A3b*(agePLnThinB-1)+_6A3c*(-1)+_6A3d*Elev+_6A3e*0+_6A3f*1+_6A3g*spinAW","v":-123.29550541974373},null,null,null,null,null,null,null,null,null,null,"Reduced age by 1 year to simulate extended regeneration delay"]
["Moist",3,6,{"$f":"_6A3a+_6A3b*(agePLnPerfB-1)+_6A3c*(-1)+_6A3d*Elev+_6A3e*(-1)+_6A3f*(-1)+_6A3g*spinAW","v":-160.61086593825092},{"$f":"_6A3a+_6A3b*(agePLnHandB-1)+_6A3c*(-1)+_6A3d*Elev+_6A3e*(-1)+_6A3f*(-1)+_6A3g*spinAW","v":597.31700972899762},{"$f":"_6A3a+_6A3b*(agePLnThinB-1)+_6A3c*(-1)+_6A3d*Elev+_6A3e*(-1)+_6A3f*(-1)+_6A3g*spinAW","v":-75.114819819743744},null,null,null,null,null,null,null,null,null,null,"Reduced age by 1 year to simulate extended regeneration delay"]
["6A4","Top height of pine in planted stands"]
["tophtPL"]
["Intercept","6A4a",-5.1776739999999997]
["GSG","6A4b",46.488787000000002]
["SNC[B]","6A4c",-92.62518]
["SNC[C]","6A4d",-4.2024800000000004]
["SMCb[MesicDry]","6A4e",6.1123601000000001]
["Elev","6A4f",-9.3075000000000005E-2]
["Slope","6A4g",-5.3104680000000002]
["spinAW","6A4h",-49.823410000000003]
["SMCb","SNC","Index","tophtPLperfPlant","tophtPLhandPlant","tophtPLthinPlant"]
[{"$f":"SMCb","v":"MesicDry"},{"$f":"SNC","v":2},{"$f":"INDEX(A415:C420,MATCH(A414&B414,A415:A420&B415:B420,0),3)","v":2},{"$f":"LOOKUP(C414,C415:C420,D415:D420)*tophtPLadj*tophtPLpAdj","v":-132.33062587096325},{"$f":"LOOKUP(C414,C415:C420,E415:E420)*tophtPLadj*tophtPLpAdj","v":696.09955846903688},{"$f":"LOOKUP(C414,C415:C420,F415:F420)*tophtPLadj*tophtPLpAdj","v":-40.282827610963217},null,null,null,null,null,null,null,null,null,null,"Top height adjusted"]
["MesicDry",1,1,{"$f":"_6A4a+_6A4b*(GSGperf)+_6A4c*1+_6A4d*0+_6A4e*1+_6A4f*Elev+_6A4g*Slope+_6A4h*spinAW","v":-222.08999885955882},{"$f":"_6A4a+_6A4b*(GSGhand)+_6A4c*1+_6A4d*0+_6A4e*1+_6A4f*Elev+_6A4g*Slope+_6A4h*spinAW","v":614.70816714044122},{"$f":"_6A4a+_6A4b*(GSGthin)+_6A4c*1+_6A4d*0+_6A4e*1+_6A4f*Elev+_6A4g*Slope+_6A4h*spinAW","v":-129.11242485955881}]
["MesicDry",2,2,{"$f":"_6A4a+_6A4b*GSGperf+_6A4c*0+_6A4d*1+_6A4e*1+_6A4f*Elev+_6A4g*Slope+_6A4h*spinAW","v":-133.66729885955883},{"$f":"_6A4a+_6A4b*GSGhand+_6A4c*0+_6A4d*1+_6A4e*1+_6A4f*Elev+_6A4g*Slope+_6A4h*spinAW","v":703.1308671404413},{"$f":"_6A4a+_6A4b*GSGthin+_6A4c*0+_6A4d*1+_6A4e*1+_6A4f*Elev+_6A4g*Slope+_6A4h*spinAW","v":-40.689724859558808}]
["MesicDry",3,3,{"$f":"_6A4a+_6A4b*GSGperf+_6A4c*(-1)+_6A4d*(-1)+_6A4e*1+_6A4f*Elev+_6A4g*Slope+_6A4h*spinAW","v":-32.637158859558824},{"$f":"_6A4a+_6A4b*GSGhand+_6A4c*(-1)+_6A4d*(-1)+_6A4e*1+_6A4f*Elev+_6A4g*Slope+_6A4h*spinAW","v":804.16100714044137},{"$f":"_6A4a+_6A4b*GSGthin+_6A4c*(-1)+_6A4d*(-1)+_6A4e*1+_6A4f*Elev+_6A4g*Slope+_6A4h*spinAW","v":60.340415140441181}]
["Moist",1,4,{"$f":"_6A4a+_6A4b*(GSGperf)+_6A4c*1+_6A4d*0+_6A4e*(-1)+_6A4f*Elev+_6A4g*Slope+_6A4h*spinAW","v":-234.31471905955883},{"$f":"_6A4a+_6A4b*(GSGhand)+_6A4c*1+_6A4d*0+_6A4e*(-1)+_6A4f*Elev+_6A4g*Slope+_6A4h*spinAW","v":602.48344694044113},{"$f":"_6A4a+_6A4b*(GSGthin)+_6A4c*1+_6A4d*0+_6A4e*(-1)+_6A4f*Elev+_6A4g*Slope+_6A4h*spinAW","v":-141.33714505955882}]
["Moist",2,5,{"$f":"_6A4a+_6A4b*GSGperf+_6A4c*0+_6A4d*1+_6A4e*(-1)+_6A4f*Elev+_6A4g*Slope+_6A4h*spinAW","v":-145.89201905955883},{"$f":"_6A4a+_6A4b*GSGhand+_6A4c*0+_6A4d*1+_6A4e*(-1)+_6A4f*Elev+_6A4g*Slope+_6A4h*spinAW","v":690.9061469404412},{"$f":"_6A4a+_6A4b*GSGthin+_6A4c*0+_6A4d*1+_6A4e*(-1)+_6A4f*Elev+_6A4g*Slope+_6A4h*spinAW","v":-52.914445059558815}]
["Moist",3,6,{"$f":"_6A4a+_6A4b*GSGperf+_6A4c*(-1)+_6A4d*(-1)+_6A4e*(-1)+_6A4f*Elev+_6A4g*Slope+_6A4h*spinAW","v":-44.861879059558831},{"$f":"_6A4a+_6A4b*GSGhand+_6A4c*(-1)+_6A4d*(-1)+_6A4e*(-1)+_6A4f*Elev+_6A4g*Slope+_6A4h*spinAW","v":791.93628694044128},{"$f":"_6A4a+_6A4b*GSGthin+_6A4c*(-1)+_6A4d*(-1)+_6A4e*(-1)+_6A4f*Elev+_6A4g*Slope+_6A4h*spinAW","v":48.115694940441202}]
["6B1a Thin","Total age of thinned aspen / balsam poplar",null,null,null,null,null,null,null,null,null,null,null,null,null,null,null,null,"New model - thin only"]
["ageAW"]
["Intercept","6B1a",3.1983782000000001]
["GST","6B1b",0.83963989999999999]
["spinAW","6B1c",-1.949435]
["Thin","ageAWperf","ageAWhand","ageAWthin"]
[false,{"$f":"IF(Weed=TRUE,B440,B435)","v":-2.3398099999999999},{"$f":"IF(Weed=TRUE,C440,C435)","v":14.677047999999999},{"$f":"IF(Weed=TRUE,D440,D435)","v":-0.44904799999999989},"B",null,null,null,null,null,null,null,null,null,null,null,null,null,"Combined results from all 6B1 b, c (no thin)"]
[true,{"$f":"_6B1a+_6B1b*IntThinPerf+_6B1c*spinAW","v":1.4725126371323529},{"$f":"_6B1a+_6B1b*IntThinHand+_6B1c*spinAW","v":16.586030837132352},{"$f":"_6B1a+_6B1b*0+_6B1c*spinAW","v":3.1517924371323529},"A",null,null,null,null,null,null,null,null,null,null,null,null,null,"From new 6B1a (Thin)"]
["6B1b NoWeed No Thin (Control)","Total age of untreated aspen / balsam poplar (no weed, no thin)",null,null,null,null,null,null,null,null,null,null,null,null,null,null,null,null,"New model"]
["ageAW"]
["Intercept","6B1Ca",0.19176190000000001]
["YSC","6B1Cb",0.80254110000000001]
["spinAW","6B1Cc",3.1375082999999999]
[null,"ageAWperf","ageAWhand","ageAWthin"]
[null,{"$f":"_6B1Ca+_6B1Cb*YSCperf+_6B1Cc*spinAW","v":0.26673912040441178},{"$f":"_6B1Ca+_6B1Cb*YSChand+_6B1Cc*spinAW","v":14.712478920404411},{"$f":"_6B1Ca+_6B1Cb*YSCthin+_6B1Cc*spinAW","v":1.8718213204044116}]
["6B1c Weed No Thin (Weed)","Total age of weeded unthinned  aspen / balsam poplar",null,null,null,null,null,null,null,null,null,null,null,null,null,null,null,null,"New model"]
["Intercept","6B1Wa",-2.3398099999999999]
["YSC","6B1Wb",0.94538100000000003]
[null,"ageAWperf","ageAWhand","ageAWthin"]
[null,{"$f":"_6B1Wa+_6B1Wb*YSCperf","v":-2.3398099999999999},{"$f":"_6B1Wa+_6B1Wb*YSChand","v":14.677047999999999},{"$f":"_6B1Wa+_6B1Wb*YSCthin","v":-0.44904799999999989}]
["6B2a (After)","Top height of aspen / balsam poplar after thinning"]
["LNtophtAW","Transformation: tophtAW = EXP(LNtophtAW)"]
["Intercept","6B2a",4.4492003999999996]
["ageAW","6B2b",0.1230439]
["spinAW","6B2c",0.412883]
["NSR[LF]","6B2d",0.1106833]
["NSR","LNtophtAWperf","LNtophtAWhand","tophtAWperfA","tophtAWhandA","LNtophtAWthin","tophtAWthinA"]
[{"$f":"NSR","v":2},{"$f":"IF(NSR=1,B449,B450)","v":4.5295674870102847},{"$f":"IF(NSR=1,C449,C450)","v":6.3891937090592643},{"$f":"EXP(B448)","v":92.718450474341154},595.37633955848651,{"$f":"IF(NSR=1,F449,F450)","v":{"$error":"#VALUE!"}},{"$f":"EXP(F448)","v":{"$error":"#VALUE!"}}]
[1,{"$f":"_6B2a+_6B2b*ageAWperfA+_6B2c*spinAW+_6B2d*1","v":4.7509340870102843},{"$f":"_6B2a+_6B2b*ageAWhandA+_6B2c*spinAW+_6B2d*1","v":6.610560309059264},115.69230074637728,742.8991552500072,{"$f":"_6B2a+_6B2b*ageAWthinA+_6B2c*spinAW+_6B2d*1","v":{"$error":"#VALUE!"}},{"$f":"EXP(F449)","v":{"$error":"#VALUE!"}}]
[2,{"$f":"_6B2a+_6B2b*ageAWperfA+_6B2c*spinAW+_6B2d*(-1)","v":4.5295674870102847},{"$f":"_6B2a+_6B2b*ageAWhandA+_6B2c*spinAW+_6B2d*(-1)","v":6.3891937090592643},92.718450474341154,595.37633955848651,{"$f":"_6B2a+_6B2b*ageAWthinA+_6B2c*spinAW+_6B2d*(-1)","v":{"$error":"#VALUE!"}},{"$error":"#VALUE!"}]
["6B2b (Before)","Top height of aspen / balsam poplar before thinning"]
["LNtophtAW","Transformation: tophtAW = EXP(LNtophtAW)"]
["Intercept","6B2a",4.4492003999999996,"(same as 6B2A)"]
["ageAW","6B2b",0.1230439,"(same as 6B2A)"]
["spinAW","6B2c",0.412883,"(same as 6B2A)"]
["NSR[LF]","6B2d",0.1106833,"(same as 6B2A)"]
["NSR","LNtophtAWperf","LNtophtAWhand","tophtAWperfA","tophtAWhandA","LNtophtAWthin","tophtAWthinA"]
[{"$f":"NSR","v":2},{"$f":"IF(NSR=1,B459,B460)","v":4.0604844416792352},{"$f":"IF(NSR=1,C459,C460)","v":6.1543050157454342},{"$f":"EXP(B458)","v":58.002403055483633},{"$f":"EXP(C458)","v":470.73957215949525},{"$f":"IF(NSR=1,F459,F460)","v":{"$error":"#VALUE!"}},{"$f":"EXP(F458)","v":{"$error":"#VALUE!"}}]
[1,{"$f":"_6B2a+_6B2b*ageAWperfB+_6B2c*spinAW+_6B2d*1","v":4.2818510416792348},{"$f":"_6B2a+_6B2b*ageAWhandB+_6B2c*spinAW+_6B2d*1","v":6.3756716157454338},72.37428390980979,587.37979201419887,{"$f":"_6B2a+_6B2b*ageAWthinB+_6B2c*spinAW+_6B2d*1","v":{"$error":"#VALUE!"}},{"$f":"EXP(F459)","v":{"$error":"#VALUE!"}}]
[2,{"$f":"_6B2a+_6B2b*ageAWperfB+_6B2c*spinAW+_6B2d*(-1)","v":4.0604844416792352},{"$f":"_6B2a+_6B2b*ageAWhandB+_6B2c*spinAW+_6B2d*(-1)","v":6.1543050157454342},58.002403055483633,470.73957215949525,{"$f":"_6B2a+_6B2b*ageAWthinB+_6B2c*spinAW+_6B2d*(-1)","v":{"$error":"#VALUE!"}},{"$error":"#VALUE!"}]
["6C1","Total age of black spruce at handover in unthinned stands"]
["Response ageSB"]
["Intercept","6C1a",9.1659664000000003]
["YSC","6C1b",0.57842159999999998]
["Elev","6C1c",-7.0219999999999996E-3]
["psSBhand","6C1d",2.3262499999999998E-2]
["spinAW","6C1e",-3.3745880000000001]
["SMCc[Dry]","6C1f",-1.4442649999999999]
["SMCc","ageSBhand"]
[{"$f":"SMCc","v":"MesicMoist"},{"$f":"IF(SMC=1,B471,B472)","v":13.052356109459904}]
["Dry",{"$f":"_6C1a+_6C1b*YSChand+_6C1c*Elev+_6C1d*psSBhand+_6C1e*spinAW+_6C1f*1","v":10.163826109459905}]
["MesicMoist",{"$f":"_6C1a+_6C1b*YSChand+_6C1c*Elev+_6C1d*psSBhand+_6C1e*spinAW+_6C1f*(-1)","v":13.052356109459904}]
["6C2","Top height of black spruce at handover in unthinned stands"]
["tophtSB"]
["Intercept","6C2a",-169.39529999999999]
["ageSB","6C2b",29.176515999999999]
["nP","6C2c",-1.2409999999999999E-2]
["psSBhand","6C2d",0.74840099999999998]
["SMCc[Dry]","6C2e",-30.372689999999999]
["SMCc",null,"tophtSBhand"]
[{"$f":"SMCc","v":"MesicMoist"},{"$f":"IF(SMC=1,B482,B483)","v":245.09417377259189},{"$f":"IF(B481<30,30,B481)","v":245.09417377259189},null,null,null,null,null,null,null,null,null,null,null,null,null,"Cannot be <30"]
["Dry",{"$f":"_6C2a+_6C2b*ageSBhand+_6C2c*nP+_6C2d*psSBhand+_6C2e*1","v":184.34879377259188}]
["MesicMoist",{"$f":"_6C2a+_6C2b*ageSBhand+_6C2c*nP+_6C2d*psSBhand+_6C2e*(-1)","v":245.09417377259189}]
["6C3","Total age of white pruce / balsam fir at handover in unthinned stands"]
["ageSW"]
["Intercept","6C3a",-54.614179999999998]
["YSC","6C3b",0.46097480000000002]
["Lat","6C3c",1.0795372000000001]
["spinSW","6C3d",6.7102639000000002]
["ageSWhand6C3"]
[{"$f":"_6C3a+_6C3b*YSChand+_6C3c*Lat+_6C3d*spinSW","v":11.518197366550488}]
["6C4","Top height of white spruce / balsam fir at handover in unthinned stands",null,null,null,null,null,null,null,null,null,null," "]
["tophtSW"]
["Intercept","6C4a",1041.9899]
["ageSW","6C4b",36.185260999999997]
["Slope","6C4c",-5.6328230000000001]
["nP","6C4d",-1.6123999999999999E-2]
["psSWhand","6C4e",1.1284182]
["Lat","6C4f",-22.60792]
["tophtSW"]
[{"$f":"_6C4a+_6C4b*ageSWhand+_6C4c*Slope+_6C4d*nP+_6C4e*psSWhand+_6C4f*Lat","v":223.49535670063824}]
["7","Adjustments to pine handover densities and DBHs for exclusion of trees with more than 50% girdling of main stem by WGR"]
["7A","denPLpHandX",null,{"$f":"0.839283*denPLpHandB","v":235.5478737882994}]
["7B","denPLnHandX",null,{"$f":"0.733511*denPLnHandB","v":3584.6921361009022}]
["7C","dbhPLpX",null,{"$f":"0.197571+0.987841*dbhPLpA","v":11.289931847572532}]
["7D","dbhPLnX",null,{"$f":"1.016237*dbhPLnA","v":15.560034898058401}]

{"sheet":"Report","index":5,"n_rows":43,"n_cols":9,"rows_kept":43,"cut":false,"hidden":false,"merged":[[30,0,32,0],[11,3,11,8],[0,6,0,7],[41,4,41,5],[31,7,31,8],[32,7,32,8],[1,0,1,8]]}
["Stand Regeneration Report",null,null,null,null,"Stand identifier:",{"$f":"StandId","v":"Example 1"}]
[{"$f":"IF(fripsy_validinput=FALSE,\"IMPORTANT NOTE: There are errors on the Input worksheet! This report is not valid!\",\"\")","v":""}]
["Stand, Site and Establishment Factors"]
["Natural sub-region:",null,{"$f":"NSRout","v":"UF"},"Elevation (m):",null,{"$f":"Elev","v":1160},"Latitude (deg.):",null,{"$f":"Lat","v":53.5}]
["Soil moisture  class:",null,{"$f":"SMCout","v":"mesic"},"Soil nutrient class:",null,{"$f":"SNCout","v":"medium"},"Depth LFH (cm):",null,{"$f":"LFHout","v":30}]
["Cone density (per m2):",null,{"$f":"ConesOut","v":"unknown"},"Slope %:",null,{"$f":"SlopeOut","v":"unknown"}]
["Secondary species % stocking",null,null,"AW:",{"$f":"psAWesOut","v":"unknown"},"SB:",{"$f":"psSBesOut","v":"unknown"},"SW:",{"$f":"psSWesOut","v":"unknown"}]
[]
["Selected Projection Options"]
[{"$f":"WGRAdjOut","v":"No adjustment for Western Gall Rust"},null,null,null,null,{"$f":"PLnExcOut","v":"PL ingress included in all projections"}]
[]
["Events",null,"Year","Details"]
["Cut (timber year of cut)",null,{"$f":"YrCout","v":2000}]
["Site preparation",null,{"$f":"YrPrepOut","v":2000},{"$f":"PrepOut","v":"Drag scarification"}]
["Plant",null,{"$f":"YrPout","v":2001},{"$f":"PearlyOut","v":" "},{"$f":"nPoutLabel","v":"Density:"},{"$f":"IFERROR(ROUND(nPout,0),\"\")","v":400},{"$f":"nPoutUnits","v":"trees per ha"}]
["Weed (last chemical)",null,{"$f":"YrWeedOut","v":2006}]
["Thin (manual)",null,{"$f":"YrThinOut","v":" Never"},null,{"$f":"nToutLabel","v":" "},{"$f":"IFERROR(ROUND(nTout,0),\"\")","v":""},{"$f":"nToutUnits","v":" "}]
["Performance assessment",null,{"$f":"YrPerfOut","v":2000}]
["Handover",null,{"$f":"YrHandOut","v":2018}]
[]
["Regeneration Forecast",null,{"$f":"PLnExcNote","v":"(PL ingress included)"}]
["Event","Years","Species","Age","Top ht","% *","Trees *","DBH","Basal area"]
[null,"since cut",null,"(years)","(m)","stocked","per ha","(cm)","(m2/ha)"]
["Thin",{"$f":"YSCthinOut","v":" "},"AW",{"$f":"ageAWthinB","v":" "},{"$f":"tophtAWthinB","v":" "},{"$f":"psAWthinB","v":" "},{"$f":"denAWthinB","v":" "}]
["(before)",null,"PL ",{"$f":"agePLthinB","v":" "},{"$f":"tophtPLthinB","v":" "},{"$f":"psPLthinB","v":" "},{"$f":"denPLthinB","v":" "}]
["Thin",{"$f":"YSCthinOut","v":" "},"AW",{"$f":"ageAWthinAout","v":" "},{"$f":"tophtAWthinA","v":" "},{"$f":"psAWthinA","v":" "},{"$f":"denAWthinA","v":" "}]
["(after)",null,"PL",{"$f":"agePLthinA","v":" "},{"$f":"tophtPLthinA","v":" "},{"$f":"psPLthinA","v":" "},{"$f":"denPLthinA","v":" "}]
["Performance",{"$f":"YSCperfOut","v":0},"AW",{"$f":"ageAWperfOut","v":" "},{"$f":"tophtAWperf","v":0.58002403055483631},{"$f":"psAWperf","v":5.0171439792905419},{"$f":"denAWperf","v":185.48544647802134}]
[{"$f":"ThinPerfNote","v":" "},null,"PL",{"$f":"agePLperf","v":0},{"$f":"tophtPLperf","v":-1.3233062587096325},{"$f":"psPLperf","v":89.815683068988008},{"$f":"denPLperf","v":8726.9392034302455}]
["Handover",{"$f":"YSChandOut","v":18},"AW",{"$f":"ageAWhand","v":14.677047999999999},{"$f":"tophtAWhandOut","v":4.7073957215949527},{"$f":"psAWhand","v":5.0171439792905419},{"$f":"denAWhand","v":65.030372066602467},{"$f":"dbhawout","v":2.3498286923370197},{"$f":"baAW","v":2.820191017362049E-2}]
[{"$f":"WGRadjNote","v":" "},null,"PL",{"$f":"agePLhand","v":18},{"$f":"tophtPLhandOut","v":6.9609955846903686},{"$f":"psPLhand","v":84.510732899765955},{"$f":"denPLhand","v":5167.6862479595493},{"$f":"dbhPL","v":5.201742892513388},{"$f":"baPL","v":10.982059293254114}]
[null,null,"SB",{"$f":"ageSBhand","v":13.052356109459904},{"$f":"tophtSB","v":2.4509417377259188},{"$f":"psSBhand","v":11.034868883442488},{"$f":"denSB","v":144.70370867837411},{"$f":"IF(AND(TRIM(D32)<>\"\",D32<9.5),\"Too young to project!\",IF(AND(TRIM(G32)<>\"\",G32<=50),\"Dens. too low to project!\",\"\"))","v":""}]
[null,null,"SW",{"$f":"ageSWhand","v":11.518197366550488},{"$f":"tophtSW","v":2.2349535670063823},{"$f":"psSWhand","v":2.8545186017877908},{"$f":"denSW","v":28.54518601787791},{"$f":"IF(AND(TRIM(D33)<>\"\",D33<9.5),\"Too young to project!\",IF(AND(TRIM(G33)<>\"\",G33<=50),\"Dens. too low to project!\",\"\"))","v":"Dens. too low to project!"}]
[]
["Yield Projection to age of PL MAI culmination at",null,null,null,{"$f":"IFERROR(INDEX(GYPSY_Projected!C$2:C$252,$I$35),\"\")","v":83},"years after cut",null,null,{"$f":"MATCH(C39,GYPSY_Projected!AY$2:AY$252,0)","v":84}]
["Species","Site index","MAI","Volume","Age","Top ht","Trees","DBH","Basal area"]
[null,"(m @ 50 yrs)","(m3/ha/yr)","(m3/ha)","(years)","(m)","(per ha)","(cm)","(m2/ha)"]
["AW",{"$f":"IF(GYPSY_Observed!AQ2>0,GYPSY_Observed!AQ2,\"\")","v":14.067793469477509},{"$f":"IF($B38<>\"\",D38/$E$35,\"\")","v":1.8171901995712149E-2},{"$f":"IF($B38<>\"\",INDEX(GYPSY_Projected!AO$2:AO$252,$I$35),\"\")","v":1.5082678656441084},{"$f":"IF($B38<>\"\",INDEX(GYPSY_Projected!D$2:D$252,$I$35),\"\")","v":79.677047999999999},{"$f":"IF($B38<>\"\",INDEX(GYPSY_Projected!K$2:K$252,$I$35),\"\")","v":17.7455884116515},{"$f":"IF($B38<>\"\",INDEX(GYPSY_Projected!H$2:H$252,$I$35),\"\")","v":63.980897018653103},{"$f":"IF($B38<>\"\",INDEX(GYPSY_Projected!L$2:L$252,$I$35),\"\")","v":10.592824840019459},{"$f":"IF($B38<>\"\",INDEX(GYPSY_Projected!F$2:F$252,$I$35),\"\")","v":0.56385026379229219}]
["PL",{"$f":"IF(GYPSY_Observed!BI2>0,GYPSY_Observed!BI2,\"\")","v":20.049010443684356},{"$f":"IF(MAX(GYPSY_Projected!AY$2:AY$252)=0,\"\",MAX(GYPSY_Projected!AY$2:AY$252))","v":4.0475622535660287},{"$f":"IF($B39<>\"\",INDEX(GYPSY_Projected!AX$2:AX$252,$I$35),\"\")","v":335.94766704598038},{"$f":"IF($B39<>\"\",INDEX(GYPSY_Projected!AE$2:AE$252,$I$35),\"\")","v":83},{"$f":"IF($B39<>\"\",INDEX(GYPSY_Projected!AL$2:AL$252,$I$35),\"\")","v":24.392718924113151},{"$f":"IF($B39<>\"\",INDEX(GYPSY_Projected!AI$2:AI$252,$I$35),\"\")","v":1114.5061716864009},{"$f":"IF($B39<>\"\",INDEX(GYPSY_Projected!AM$2:AM$252,$I$35),\"\")","v":20.300613719714981},{"$f":"IF($B39<>\"\",INDEX(GYPSY_Projected!AG$2:AG$252,$I$35),\"\")","v":36.073700411073368}]
["SB",{"$f":"IF(GYPSY_Observed!AW2>0,GYPSY_Observed!AW2,\"\")","v":15.117821560259445},{"$f":"IF($B40<>\"\",D40/$E$35,\"\")","v":9.7855670942654807E-2},{"$f":"IF($B40<>\"\",INDEX(GYPSY_Projected!AR$2:AR$252,$I$35),\"\")","v":8.1220206882403492},{"$f":"IF($B40<>\"\",INDEX(GYPSY_Projected!M$2:M$252,$I$35),\"\")","v":78.052356109459907},{"$f":"IF($B40<>\"\",INDEX(GYPSY_Projected!T$2:T$252,$I$35),\"\")","v":18.259674964427592},{"$f":"IF($B40<>\"\",INDEX(GYPSY_Projected!Q$2:Q$252,$I$35),\"\")","v":86.99631665315998},{"$f":"IF($B40<>\"\",INDEX(GYPSY_Projected!U$2:U$252,$I$35),\"\")","v":16.111137095279933},{"$f":"IF($B40<>\"\",INDEX(GYPSY_Projected!O$2:O$252,$I$35),\"\")","v":1.7735487608309417}]
["SW",{"$f":"IF(GYPSY_Observed!BC2>0,GYPSY_Observed!BC2,\"\")","v":16.51429314237436},0,{"$f":"IF($B41<>\"\",INDEX(GYPSY_Projected!AU$2:AU$252,$I$35),\"\")","v":0},{"$f":"IF($B41<>\"\",INDEX(GYPSY_Projected!V$2:V$252,$I$35),\"\")","v":0},{"$f":"IF($B41<>\"\",INDEX(GYPSY_Projected!AC$2:AC$252,$I$35),\"\")","v":0},{"$f":"IF($B41<>\"\",INDEX(GYPSY_Projected!Z$2:Z$252,$I$35),\"\")","v":0},{"$f":"IF($B41<>\"\",INDEX(GYPSY_Projected!AD$2:AD$252,$I$35),\"\")","v":0},{"$f":"IF($B41<>\"\",INDEX(GYPSY_Projected!X$2:X$252,$I$35),\"\")","v":0}]
["Con",null,{"$f":"IF(ISNA(I35),\"\",SUM(C39:C41))","v":4.145417924508684},{"$f":"IFERROR(INDEX(GYPSY_Projected!BA$2:BA$252,$I$35),\"\")","v":344.06968773422074},{"$f":"IF(gypsy_available=FALSE,\"GYPSY DLL is unavailable!\",IF(IncYieldSummary=FALSE,\"No output requested.\",IF(gypsy_validinput=FALSE,\"GYPSY input error!\",\"\")))","v":"GYPSY input error!"},null,{"$f":"IF(ISNA(I35),\"\",SUM(G39:G41))","v":1201.5024883395608},{"$f":"IF(ISNA(I35),\"\",qmd(I42,G42))","v":20.026722577345605},{"$f":"IF(ISNA(I35),\"\",SUM(I39:I41))","v":37.847249171904309}]
["* Based on minimum tree height 0.3m for conifers at thinning and performance, and 1.3m  for AW (always) and conifers at handover. "]

{"sheet":"Batch_Setup","index":6,"n_rows":2,"n_cols":25,"rows_kept":2,"cut":false,"hidden":false,"merged":[]}
["StandId","SNC","SMC","NSR","Elev","Lat","LFH","Slope","Cones","PsAW","PsSB","PsSW","WGR","ExPLnat","YrCut","Prep","YrPrep","YrPlant","PSph","PEarly","YrWeed","YrThin","ThinSph","YrPerf","Status"]
["Example 1",2,2,"UF",500,55,100,30,100,null,null,null,null,null,2000,1,null,2012,700,null,null,2012,4000,2014,"!!"]

{"sheet":"Batch_Output","index":7,"n_rows":4,"n_cols":149,"rows_kept":4,"cut":false,"hidden":false,"merged":[[0,135,0,147],[0,115,0,134],[0,77,0,114],[0,0,0,30],[0,31,0,39],[0,40,0,47],[0,48,0,56],[0,57,0,76]]}
["Input Data",null,null,null,null,null,null,null,null,null,null,null,null,null,null,null,null,null,null,null,null,null,null,null,null,null,null,null,null,null,null,"Before Thinning",null,null,null,null,null,null,null,null,"After Thinning",null,null,null,null,null,null,null,"Performance Assessment",null,null,null,null,null,null,null,null,"Handover",null,null,null,null,null,null,null,null,null,null,null,null,null,null,null,null,null,null,null,"GYPSY Projection @ PL Culmination Age",null,null,null,null,null,null,null,null,null,null,null,null,null,null,null,null,null,null,null,null,null,null,null,null,null,null,null,null,null,null,null,null,null,null,null,null,null,"Errors and Warnings",null,null,null,null,null,null,null,null,null,null,null,null,null,null,null,null,null,null,null,"Internal Checks",null,null,null,null,null,null,null,null,null,null,null,null,"GYPSY"]
["Stand identifier","Soil nutrient class","Soil moisture class","Natural subregion","Elevation (m)","Latitude (degrees)","Depth of LFH (cm)","Slope percent","Cones per m2","Percent stocking AW at ES","Percent stocking SB at ES","Percent stocking SW at ES","Adjust for Western Gall Rust","Exclude PL natural regen","Include yield projection in summary","Include detailed GYPSY output","Year of cut","Site prep. method","Year of site prep","Planted","Year of planting","Planted trees per ha","Planting advanced","Weeded","Year of weeding","Thinned","Year of Thinning","Post-thinning density target (trees/ha)","Year of perf assess","Year of handover","Input Validation Status","Stand age at thinning  (years)","AW age (years) before thinning","AW top height (m) before thinning","AW percent stocking before thinning","AW density (trees/ha) before thinning","PL age (years) before thinning","PL top height (m) before thinning","PL percent stocking before thinning","PL density (trees/ha) before thinning","AW age (years) after thinning","AW top height (m) after thinning","AW percent stocking after thinning","AW density (trees/ha) after thinning","PL age (years) after thinning","PL top height (m) after thinning","PL percent stocking after thinning","PL density (trees/ha) after thinning","Stand age at perf. ass. (years)","AW age (years) at perf. ass.","AW top height (m) at perf. ass.","AW percent stocking at perf. ass.","AW density (trees/ha) at perf. ass.","PL age (years) at perf. ass.","PL top height (m) at perf. ass.","PL percent stocking at perf. ass.","PL density (trees/ha) at perf. ass.","AW age (years) at handover","AW top height (m) at handover","AW percent stocking at handover","AW density (trees/ha) at handover","AW DBH (cm) at handover","AW basal area (m2/ha) at handover","PL age (years) at handover","PL top height (m) at handover","PL percent stocking at handover","PL density (trees/ha) at handover","PL DBH (cm) at handover","PL basal area (m2/ha) at handover","SB age (years) at handover","SB top height (m) at handover","SB percent stocking at handover","SB density (trees/ha) at handover","SW age (years) at handover","SW top height (m) at handover","SW percent stocking at handover","SW density (trees/ha) at handover","Stand age at PL culmination (years)","AW site index (m)","AW MAI (m3/ha/yr)","AW gross merch. vol. (m3/ha)","AW total age (years)","AW top height (m)","AW density (trees/ha)","AW DBH (cm)","AW basal area (m2/ha)","PL site index (m)","PL MAI (m3/ha/yr)","PL gross merch. vol. (m3/ha)","PL total age (years)","PL top height (m)","PL density (trees/ha)","PL DBH (cm)","PL basal area (m2/ha)","SB site index (m)","SB MAI (m3/ha/yr)","SB gross merch. vol. (m3/ha)","SB total age (years)","SB top height (m)","SB density (trees/ha)","SB DBH (cm)","SB basal area (m2/ha)","SW site index (m)","SW MAI (m3/ha/yr)","SW gross merch. vol. (m3/ha)","SW total age (years)","SW top height (m)","SW density (trees/ha)","SW DBH (cm)","SW basal area (m2/ha)","Conifer MAI (m3/ha/yr)","Conifer gross merch. vol. (m3/ha)","Conifer density (trees/ha)","Conifer DBH (cm)","Conifer basal area (m2/ha)","Missing cones per m2","Missing elevation","Missing latitude","Missing depth to LFH","Infeasible or missing thinning density target","Planting density issue","Missing Ps AW at estab. survey","Missing Ps SB at estab. survey","Missing Ps SW at estab. survey","Missing slope percent","Missing stand identifier","Missing or invalid stand input","Missing year of performance assessment","Missing year of cut","Planting year issue","Site prep. year issue","Thinning year issue","Weeding year issue","SB input issue at handover","SW input issue at handover",null,null,null,null,null,null,null,null,null,null,null,null,null,"Run Status"]
["StandId","SNC","SMC","NSR","Elev","Lat","LFH","Slope","Cones","PsAW","PsSB","PsSW","WGR","ExPLnat","IncYieldSum","IncGYPSY","YrCut","Prep","YrPrep","Plant","YrPlant","PSph","PEarly","Weed","YrWeed","Thin","YrThin","ThinSph","YrPerf","YrHand","Status","YSCthin","ageAWthinB","thAWthinB","psAWthinB","denAWthinB","agePLthinB","thPLthinB","psPLthinB","denPLthinB","ageAWthinA","thAWthinA","psAWthinA","denAWthinA","agePLthinA","thPLthinA","psPLthinA","denPLthinA","YSCperf","ageAWperf","thAWperf","psAWperf","denAWperf","agePLperf","thPLperf","psPLperf","denPLperf","ageAWhand","thAWhand","psAWhand","denAWhand","qmdAWhand","baAWhand","agePLhand","thPLhand","psPLhand","denPLhand","qmdPLhand","baPLhand","ageSBhand","thSBhand","psSBhand","denSBhand","ageSWhand","thSWhand","psSWhand","denSWhand","CulmAge","siAWproj","maiAWproj","volAWproj","ageAWproj","thAWproj","denAWproj","qmdAWproj","baAWproj","siPLproj","maiPLproj","volPLproj","agePLproj","thPLproj","denPLproj","qmdPLproj","baPLproj","siSBproj","maiSBproj","volSBproj","ageSBproj","thSBproj","denSBproj","qmdSBproj","baSBproj","siSWproj","maiSWproj","volSWproj","ageSWproj","thSWproj","denSWproj","qmdSWproj","baSWproj","maiCOproj","volCOproj","denCOproj","qmdCOproj","baCOproj","ConesMiss","ElevMiss","LatMiss","LFHmiss","nTwarning","PlantDataWarning","psAWesMiss","psSBesMiss","psSWesMiss","SlopeMiss","StandMiss","StandErrorWarning","YSCperfEarlyLate","YSCzeroOutNote","YrPlantWarning","YrPrepWarning","YrThinWarning","YrWeedWarning","warnSBhand","warnSWhand","MaxBaPLcheck","MaxDbhDenPLnAcheck","MaxDbhDenPLpAcheck","MaxDbhDenPLnBcheck","MaxDbhDenPLpBcheck","MaxDbhPLnAcheck","MaxDbhPLpAcheck","MaxDbhPLnBcheck","MaxDbhPLpBcheck","MaxDenPLnCheck","MaxSpinAWweedCheck","MaxTophtPLnCheck","MaxTophtPLpCheck","GYPSYRun"]
["Example 1",2,2,"UF",1160,53.5,null,null,null,null,null,null,false,false,true,true,2000,1,null,true,2001,1600,false,false,null,true,2012,4000,2014,2018,"OK",12,10.761326810686253,3.2577619868244159,35.331570903495972,1121.6146808073697,12,4.0637162186412024,94.78030269725096,7272.1034331811661,2.6149026884542117,1.1956292997738336,1.1661730398307881,26.938618064306667,12,4.0637162186412024,94.836673844791221,5672.1232450797006,14,4.2941824884542124,1.4700520278291012,3.0856141865497304,71.277742861668742,14,4.9841942012412037,94.771915847818789,5653.2719684763733,7.6527420884542119,2.2223119320196356,18.819112887449467,434.72184407352847,0.45876738144816009,7.1859866876712161E-3,18,6.8251501664412038,94.898183229967728,4000,7.5237020949531104,17.783328658827052," "," "," "," "," "," "," "," ",76,15.744202263334637,0.39509659638122985,30.02734132497347,65.652742088454204,17.698842825695706,281.9460757194035,17.050775933289469,6.4379000548965779,19.775800359656643,4.4454426306929609,337.85363993266503,76,23.190051118871843,1105.3617580346711,20.838707835403628,37.699525862031315,null,null,null,null,null,null,null,null,null,null,null,null,null,null,null,null,4.4454426306929609,337.85363993266503,1105.3617580346711,20.838707835403628,37.699525862031315,false,false,false,false,"Thinning target OK","Planting density OK",false,false,false,false,false,"Inputs for stand and site factors OK","Year OK","Year OK","Year OK","OK","Year OK","OK ",null,null,null,null,null,null,null,null,null,null,null,null,null,null,null,"OK"]

{"sheet":"Batch_Controls","index":8,"n_rows":7,"n_cols":3,"rows_kept":7,"cut":false,"hidden":true,"merged":[]}
["VERSION",{"$f":"fripsy_app_version","v":"2022-08-03p"}]
["OUTPUT","C:\\Users\\Wynford\\Dropbox\\Shared files"]
["PDF",false]
["CSV",true,"always output batch processing data?"]
["NUMRUNS",1]
["ONE STAND"]
["GYPSY",false]

{"sheet":"GYPSY_Observed","index":9,"n_rows":2,"n_cols":66,"rows_kept":2,"cut":false,"hidden":false,"merged":[]}
["gypsy_model_id","stand_id","standtype","standage","spatial","ba_known","sdob_aw","tdib_aw","stht_aw","sdob_sb","tdib_sb","stht_sb","sdob_sw","tdib_sw","stht_sw","sdob_pl","tdib_pl","stht_pl","tage_aw","bage_aw","topht_aw","den13_aw","ps_aw","ba_aw","tage_sb","bage_sb","topht_sb","den03_sb","ps_sb","ba_sb","tage_sw","bage_sw","topht_sw","den03_sw","ps_sw","ba_sw","tage_pl","bage_pl","topht_pl","den03_pl","ps_pl","ba_pl","SI_bh_aw","SI_t_aw","y2bh_aw","SDF_aw","N0_aw","PSI_aw","SI_bh_sb","SI_t_sb","y2bh_sb","SDF_sb","N0_sb","PSI_sb","SI_bh_sw","SI_t_sw","y2bh_sw","SDF_sw","N0_sw","PSI_sw","SI_bh_pl","SI_t_pl","y2bh_pl","SDF_pl","N0_pl","PSI_pl"]
[20090521,"Example 1","Regenerated",18,"Y","Y",15,10,0.3,15,10,0.3,15,10,0.3,15,10,0.3,14.677047999999999,10.10498918323211,4.7073957233422785,65.030372066602467,5.0171439792905419,2.820191017362049E-2,13.052356109459904,4.1470121044779908,2.4509417377259188,144.70370867837411,11.034868883442488,null,11.518197366550488,3.1790316389524271,2.2349535670063823,null,2.8545186017877908,null,18,12.068753402571524,6.9609955846903686,5167.6862479595493,84.510732899765955,10.982059293254114,14.067793469477509,13.260344882748713,4.5720588167678899,64.771947664646873,null,4.9045698876871189,15.117821560259445,13.245928359043438,8.905344004981913,121.75728304017301,null,10.68406033311998,16.51429314237436,14.435052455161349,8.3391657275980613,null,null,2.8115491993055803,20.049010443684356,18.687423246015076,5.9312465974284772,2330.1163337089283,null,73.340101764448235]

{"sheet":"GYPSY_Projected","index":10,"n_rows":252,"n_cols":60,"rows_kept":252,"cut":false,"hidden":false,"merged":[]}
["gypsy_model_id","stand_id","standage_p","tage_aw","bage_aw","ba_aw","ps_aw","den13_aw","mden13_aw","sc_aw","topht_aw","qmd_aw","tage_sb","bage_sb","ba_sb","ps_sb","den03_sb","mden03_sb","sc_sb","topht_sb","qmd_sb","tage_sw","bage_sw","ba_sw","ps_sw","den03_sw","mden03_sw","sc_sw","topht_sw","qmd_sw","tage_pl","bage_pl","ba_pl","ps_pl","den03_pl","mden03_pl","sc_pl","topht_pl","qmd_pl","tv_aw","mv_aw","mai_aw","tv_sb","mv_sb","mai_sb","tv_sw","mv_sw","mai_sw","tv_pl","mv_pl","mai_pl","tv_con","mv_con","mai_con","tv_dec","mv_dec","mai_dec","tv_tot","mv_tot","mai_tot"]
[20090521,"Example 1",0]
[20090521,"Example 1",1]
[20090521,"Example 1",2]
[20090521,"Example 1",3]
[20090521,"Example 1",4]
[20090521,"Example 1",5]
[20090521,"Example 1",6]
[20090521,"Example 1",7]
[20090521,"Example 1",8]
[20090521,"Example 1",9]
[20090521,"Example 1",10]
[20090521,"Example 1",11]
[20090521,"Example 1",12]
[20090521,"Example 1",13]
[20090521,"Example 1",14]
[20090521,"Example 1",15]
[20090521,"Example 1",16]
[20090521,"Example 1",17]
[20090521,"Example 1",18,14.677047999999999,10.10498918323211,2.820191017362049E-2,5.0171439792905419,65.030372066466782,7.1224275647267827,1.2093228368166642E-2,4.7073957233422785,2.3498286923394711,13.052356109459904,4.1470121044779908,2.581342124567234E-2,11.034868883442488,144.70370867899635,0.54040734753132635,2.6909503039397837E-2,2.450941738324885,1.5070859206874918,null,null,null,null,null,null,null,null,null,18,12.068753402571524,10.982059293254114,84.510732899765955,5167.6862479442798,12.059847600749535,0.96099726859243551,6.960995586577341,5.2017428925210734,2.5733498924520416E-2,1.507076214857897E-6,1.0268251591586381E-7,3.0221689443609326E-2,3.2792808865492794E-7,1.8218227147495995E-8,null,null,null,33.188348555148224,9.6983853614508286E-2,5.3879918674726822E-3,33.218570244591831,9.6984181542596942E-2,5.3880100856998304E-3,2.5733498924520416E-2,1.507076214857897E-6,8.3726456380994286E-8,33.244303743516355,9.6985688618811794E-2,5.3880938121562104E-3]
[20090521,"Example 1",19,15.677047999999999,11.10498918323211,7.1001226743943657E-2,5.016577658718302,65.029941681234476,8.9288017875505297,1.2340016153101544E-2,5.0233010484089595,3.728475582420713,14.052356109459904,5.1470121044779908,4.0286224422064441E-2,11.032464841852901,144.54699209399416,1.7678301985832467,2.7429091449375397E-2,2.7535433750095502,1.883774066587214,null,null,null,null,null,null,null,null,null,19,13.068753402571524,11.936180880271237,84.273106455869865,5060.2655748903553,21.230891126982915,0.96023089239752302,7.4491422334589341,5.4802592013377884,7.6709917272939729E-2,1.9349771490005751E-5,1.2342739200649096E-6,5.204454571814978E-2,1.6555648900138875E-6,8.713499421125724E-8,null,null,null,38.760942653933363,0.15565372421670881,8.1923012745636209E-3,38.812987199651509,0.15565537978159882,8.1923884095578322E-3,7.6709917272939729E-2,1.9349771490005751E-5,1.0184090257897764E-6,38.889697116924452,0.15567472955308884,8.1934068185836231E-3]
[20090521,"Example 1",20,16.677047999999999,12.10498918323211,0.1134700411353893,5.0159432671537401,65.02941160134732,10.769746054909374,1.2599037397279703E-2,5.3342026961759679,4.7134700650152022,15.052356109459904,6.1470121044779908,5.7496908454418863E-2,11.029832148347172,144.3704443429385,3.0601292275435248,2.7970860915814962E-2,3.0627988178445298,2.2518432680714304,null,null,null,null,null,null,null,null,null,20,14.068753402571524,12.863721395831675,84.027556774225388,4952.058877037015,34.395575407449954,0.95943010168690523,7.9320346776496207,5.7510278708006002,0.14228224943249673,8.3845492303392802E-5,5.0275979479937223E-6,8.1343904896861108E-2,6.2077008206842712E-6,3.1038504103421354E-7,null,null,null,44.610797575466613,0.24027020005473121,1.2013510002736561E-2,44.692141480363475,0.2402764077555519,1.2013820387777594E-2,0.14228224943249673,8.3845492303392802E-5,4.19227461516964E-6,44.834423729795972,0.24036025324785529,1.2018012662392764E-2]
[20090521,"Example 1",21,17.677047999999999,13.10498918323211,0.15576453431203935,5.0152353849458891,65.028769028273501,12.632921172122145,1.2870234415292149E-2,5.6400833538400308,5.5225109200845637,16.052356109459904,7.1470121044779908,7.7221370505563797E-2,11.026958554032236,144.17311139995121,4.4079813184665664,2.8534166766906507E-2,3.3774543058856379,2.6114497671871595,null,null,null,null,null,null,null,null,null,21,15.068753402571524,13.764645251635356,83.774119007470873,4843.4464964348772,52.110836984779873,0.95859559881780143,8.4088267828376964,6.0153419099907834,0.22245158471684692,2.4692450101356775E-4,1.3968650252777939E-5,0.11882554357628909,1.8944948218611049E-5,9.0214039136243089E-7,null,null,null,50.706463252868645,0.35885401100750408,1.7088286238452575E-2,50.825288796444937,0.35887295595572272,1.7089188378843941E-2,0.22245158471684692,2.4692450101356775E-4,1.1758309572074655E-5,51.047740381161788,0.35911988045673626,1.7100946688416014E-2]
[20090521,"Example 1",22,18.677047999999999,14.10498918323211,0.19794126995489203,5.0144483391349812,65.02800064369211,14.506584153388644,1.315354767098023E-2,5.9409553234753743,6.2254827599925218,17.052356109459904,8.1470121044779908,9.923991181064E-2,11.023831529369426,143.9540799039745,5.8040668275683274,2.9118331083622221E-2,3.6963770673359826,2.9626902968981006,null,null,null,null,null,null,null,null,null,22,16.068753402571524,14.639065869284442,83.512833509394255,4734.7792734449849,74.735455271244092,0.95772812124539752,8.8788206844794608,6.2742507733012207,0.31690258980851976,5.9014214460854746E-4,3.1597185198032768E-5,0.16507678708424731,4.9670704401335313E-5,2.2577592909697868E-6,null,null,null,57.017910184909134,0.52100761719811195,2.3682164418095997E-2,57.18298697199338,0.52105728790251327,2.3684422177386966E-2,0.31690258980851976,5.9014214460854746E-4,2.6824642936752156E-5,57.499889561801901,0.52164743004712177,2.3711246820323717E-2]
[20090521,"Example 1",23,19.677047999999999,15.10498918323211,0.23998670736641808,5.0135761988462884,65.027092628070648,16.379749160037303,1.3448915891896647E-2,6.2368533127133805,6.8549056941981945,18.052356109459904,9.1470121044779908,0.12333963824903595,11.020438269185316,143.71247897324679,7.242293892783481,2.9722642735726858E-2,4.0185447939275498,3.3056673939560972,null,null,null,null,null,null,null,null,null,23,17.068753402571524,15.487210209398949,83.243745953188466,4626.3782290276031,102.41558257289614,0.95682844137237655,9.3414478246215609,6.5286154445426945,0.42509681664997073,1.2322572516928118E-3,6.2624091362322834E-5,0.22056761389070192,1.1583896790443584E-4,5.0364768654102539E-6,null,null,null,63.516604957628182,0.73806213547266508,3.2089658064028914E-2,63.737172571518883,0.73817797444056954,3.2094694540894329E-2,0.42509681664997073,1.2322572516928118E-3,5.3576402247513561E-5,64.162269388168852,0.73941023169226239,3.2148270943141842E-2]
[20090521,"Example 1",24,20.677047999999999,16.10498918323211,0.28183987046925674,5.0126127708482198,65.026030677522698,18.242314717590713,1.3756276187137014E-2,6.5278289529251392,7.4286971283639689,19.052356109459904,10.147012104477991,0.14931603619998926,11.016765697617179,143.44748211749896,8.7174051576702531,3.0346357632433773E-2,4.3430361160466893,3.6405065831976646,null,null,null,null,null,null,null,null,null,24,18.068753402571524,16.309392431419614,82.966907412314299,4518.534711881809,135.09171299768326,0.9558973661804292,9.796252208644697,6.7791483719488639,0.5463259975701098,2.3361213233803759E-3,1.1298137545458017E-4,0.28565449039636831,2.4609156193583357E-4,1.0253815080659732E-5,null,null,null,70.175560906076527,1.0232108226693488,4.2633784277889532E-2,70.461215396472895,1.0234569142312846,4.2644038092970189E-2,0.5463259975701098,2.3361213233803759E-3,9.7338388474182329E-5,71.007541394043002,1.0257930355546649,4.2741376481444375E-2]
[20090521,"Example 1",25,21.677047999999999,17.10498918323211,0.32340951921627575,5.0115515953087275,65.024800019236423,20.08515484055863,1.4075564167967219E-2,6.8139465937839141,7.9577803219853509,20.052356109459904,11.147012104477991,0.17697395511005415,11.012800473206548,143.1583092123806,10.224740581704447,3.098869918708622E-2,4.6690219412292864,3.967358603895649,null,null,null,null,null,null,null,null,null,25,19.068753402571524,17.105993916729652,82.682374410600616,4411.5109394956144,172.52050655881712,0.95493573664494658,10.242875634639072,7.0264431320919511,0.67975265894755033,4.1141927533611799E-3,1.8979488135843867E-4,0.36058612457143552,4.8444143607844002E-4,1.93776574431376E-5,null,null,null,76.969365751969406,1.3916212316333976,5.5664849265335901E-2,77.329951876540846,1.3921056730694761,5.5684226922779044E-2,0.67975265894755033,4.1141927533611799E-3,1.6456771013444719E-4,78.009704535488396,1.3962198658228373,5.5848794632913493E-2]
[20090521,"Example 1",26,22.677047999999999,18.10498918323211,0.36458690584144482,5.0103859417829426,65.023385425703722,21.900174470493454,1.4406714070611323E-2,7.0952800527342967,8.4493014352227984,21.052356109459904,12.147012104477991,0.20612816902048681,11.008528994285335,142.84422850358101,11.760077311392234,3.164885899457745E-2,4.9957575479046801,4.2863969101705308,null,null,null,null,null,null,null,null,null,26,20.068753402571524,17.877447850369965,82.390208946355088,4305.5408640210635,214.30540128128641,0.95394442693481118,10.681044674234963,7.2709969337511131,0.8244436834371226,6.8320197777753623E-3,3.0127465346350914E-4,0.44551052603364388,8.9495301234815243E-4,3.4421269705698172E-5,null,null,null,83.87418869560851,1.8605167598753636,7.1558336918283214E-2,84.319699221642153,1.8614117128877117,7.1592758187988909E-2,0.8244436834371226,6.8320197777753623E-3,2.6276999145289856E-4,85.144142905079278,1.868243732665487,7.185552817944181E-2]
[20090521,"Example 1",27,23.677047999999999,19.10498918323211,0.40525502977487926,5.0091088054648774,65.02177122793762,23.68033169933998,1.4749658880510021E-2,7.3719100868349372,8.9081981418030551,22.052356109459904,13.147012104477991,0.23660363831595879,11.003937404756913,142.50455861035448,13.319514317957537,3.2325997719318732E-2,5.3225753481211537,4.5978139113514418,null,null,null,null,null,null,null,null,null,27,21.068753402571524,18.624227145942523,82.090478493999868,4200.8312975951403,259.93111672315882,0.95292434340017118,11.110559208011434,7.5132280067526631,0.97939864845111424,1.080914005957203E-2,4.5652397459227306E-4,0.54048289695433993,1.5667161160893947E-3,5.802652281812573E-5,null,null,null,90.867769767460473,2.449217041052743,9.0711742261212702E-2,91.408252664414817,2.4507837571688325,9.0769768784030827E-2,0.97939864845111424,1.080914005957203E-2,4.0033852072488999E-4,92.387651312865927,2.4615928972284045,9.1170107304755721E-2]
[20090521,"Example 1",28,24.677047999999999,20.10498918323211,0.44529516663358443,5.0077129037366497,65.019941327830537,25.419630662106911,1.5104330457308733E-2,7.6439224164984365,9.3380407172771189,23.052356109459904,14.147012104477991,0.26823555715826525,10.999011600348231,142.13867049995173,14.899386550831201,3.3019246190473688E-2,5.6488782492423395,4.9018171667460217,null,null,null,null,null,null,null,null,null,28,22.068753402571524,19.346834872271671,81.783255985881468,4097.5632367576,308.7984501948867,0.95187642335221767,11.531282339927623,7.7534892563615925,1.1435736993387555,1.6416999207683261E-2,6.6527403146775341E-4,0.64547398316301396,2.61887027101111E-3,9.3531081107539639E-5,null,null,null,97.929394312201239,3.1791256231498761,0.11354020082678129,98.574868295364254,3.1817444934208874,0.11363373190788884,1.1435736993387555,1.6416999207683261E-2,5.8632140027440216E-4,99.718441994703014,3.1981614926285706,0.11422005330816323]
[20090521,"Example 1",29,25.677047999999999,21.10498918323211,0.48459131841163416,5.0061906730496997,65.017879209781142,27.113089812498675,1.5470659659791039E-2,7.9114061746197715,9.7415143438010539,24.052356109459904,15.147012104477991,0.30086924770331303,10.993737235392093,141.74598940598014,16.496200343109578,3.3727706699949844E-2,5.9741335567098286,5.1986259403294675,null,null,null,null,null,null,null,null,null,29,23.068753402571524,20.045796585189507,81.46861977630175,3995.893331501285,360.25693656643637,0.95080163364025916,11.943131534129444,7.9920791376161553,1.3159014094277359,2.4073679748571709E-2,9.3755636351077853E-4,0.76037859869696089,4.2054126363037661E-3,1.4501422883806089E-4,null,null,null,105.03985536723157,4.0736528048524425,0.14047078637422217,105.80023396592853,4.0778582174887461,0.1406158006030602,1.3159014094277359,2.4073679748571709E-2,8.3012688788178311E-4,107.11613537535627,4.1019318972373178,0.14144592749094198]
[20090521,"Example 1",30,26.677047999999999,22.10498918323211,0.52303311188658652,5.0045342661737511,65.015567951696625,28.756690633258909,1.5848576469935999E-2,8.1744526861736535,10.120709770270784,25.052356109459904,16.147012104477991,0.33435994546185566,10.988099730187423,141.32599666508577,18.106584997545404,3.4450454497307548E-2,6.2978673690323097,5.4884682185624269,null,null,null,null,null,null,null,null,null,30,24.068753402571524,20.721654132439667,81.146653589391519,3895.9554508298784,413.63389104214656,0.94970096903275636,12.346070834362548,8.2292504235784332,1.495307023575563,3.4235441584313651E-2,1.2833294592532747E-3,0.8850241048925479,6.5195158643871851E-3,2.1731719547957284E-4,null,null,null,112.18140647964056,5.1580615619988892,0.17193538539996298,113.06643058453311,5.1645810778632768,0.17215270259544255,1.495307023575563,3.4235441584313651E-2,1.1411813861437884E-3,114.56173760810867,5.1988165194475906,0.17329388398158635]
[20090521,"Example 1",31,27.677047999999999,23.10498918323211,0.56051756356910798,5.0027355498507724,65.012990235461331,30.34731178209735,1.6238010115249623E-2,8.4331545063463356,10.477305353354218,26.052356109459904,17.147012104477991,0.36857250843291189,10.982084278977812,140.87823144766878,19.727257105313893,3.5186539474352033E-2,6.6196594230153467,5.7715781822230676,null,null,null,null,null,null,null,null,null,31,25.068753402571524,21.374960613068023,80.817446452147479,3797.8623031656812,468.25907271996732,0.94857545041039837,12.740104041349051,8.4652173527112744,1.6807214948230895,4.7385290065323146E-2,1.7120789061507986E-3,1.01917868006997,9.797090949142424E-3,3.1603519190782014E-4,null,null,null,119.33770723307059,6.4592254041492447,0.20836210981126596,120.35688591314056,6.469022495098387,0.20867814500317378,1.6807214948230895,4.7385290065323146E-2,1.5285577440426821E-3,122.03760740796365,6.5164077851637101,0.21020670274721645]
[20090521,"Example 1",32,28.677047999999999,24.10498918323211,0.5969500352899344,5.0007861028927314,65.01012835694975,31.882653338606225,1.6638889188500643E-2,8.6876046621878036,10.812684690019754,27.052356109459904,18.147012104477991,0.40338107423900649,10.975675858583044,140.40229235967453,21.354995067910135,3.593498803074361E-2,6.939138352499346,6.0481940849562781,null,null,null,null,null,null,null,null,null,32,26.068753402571524,22.006276252404131,80.48109261373753,3701.7070762915723,523.48472249849328,0.94742612278075578,13.125268737068051,8.700161510885728,1.8710917376992982,6.4018993387115419E-2,2.2324122548149105E-3,1.1625592602173072,1.4319353357102989E-2,4.4747979240946842E-4,null,null,null,126.49376346475076,8.0052889676417962,0.25016528023880613,127.65632272496806,8.0196083209988984,0.25061276003121558,1.8710917376992982,6.4018993387115419E-2,2.0005935433473569E-3,129.52741446266737,8.083627314386014,0.25261335357456294]
[20090521,"Example 1",33,29.677047999999999,25.10498918323211,0.63224462601298392,4.9986772147636005,65.006964235651154,33.361155295064535,1.7051141763980638E-2,8.93789605535944,11.128014680685846,28.052356109459904,19.147012104477991,0.43866868336298137,10.968859237714371,139.89783889389318,22.98662186560486,3.6694805110528216E-2,7.2559773279700002,6.3185564823473968,null,null,null,null,null,null,null,null,null,33,27.068753402571524,22.616165010875143,80.137691452025265,3607.5650675376442,578.70108033054601,0.94625405312549116,13.501631057080909,8.9342367127149913,2.0653885168217458,8.4629152023019169E-2,2.8516701534134787E-3,1.3148390666642278,2.0414186581771302E-2,6.1861171459913033E-4,null,null,null,133.63586386583418,9.8252253517226062,0.29773410156735169,134.95070293249842,9.8456395383043773,0.29835271328195084,2.0653885168217458,8.4629152023019169E-2,2.5645197582733082E-3,137.01609144932016,9.9302686903273969,0.30091723304022416]
[20090521,"Example 1",34,30.677047999999999,26.10498918323211,0.6663241822541528,4.9963998846876789,65.003479423964606,34.781913808943813,1.7474695509407924E-2,9.1841209930113621,11.424298577339519,29.052356109459904,20.147012104477991,0.47432688204380369,10.961618987001197,139.36459271068611,24.618994505115733,3.7464976398079664E-2,7.5698900476694968,6.582906757662971,null,null,null,null,null,null,null,null,null,34,28.068753402571524,23.205191786532197,79.787347368153661,3515.4952805039352,633.3477115662148,0.94506032809251239,13.869281123000279,9.1675730822375012,2.2626123651490646,0.10968806523376434,3.5755743262443095E-3,1.4756546650699682,2.8456143596704508E-2,8.3694539990307373E-4,null,null,null,140.75151438851512,11.948288740961432,0.35142025708710095,142.2271690535851,11.976744884558137,0.35225720248700404,2.2626123651490646,0.10968806523376434,3.2261195656989512E-3,144.48978141873417,12.086432949791901,0.35548332205270294]
[20090521,"Example 1",35,31.677047999999999,27.10498918323211,0.69912006001981131,4.9939448213279887,64.999655116216076,36.144598075307634,1.7909477792604607E-2,9.4263708209951371,11.702412834680313,30.052356109459904,21.147012104477991,0.51025531498234233,10.953939489754221,138.80233872965857,26.248998861638629,3.8244470660587046E-2,7.8806270534978937,6.8414858965518075,null,null,null,null,null,null,null,null,null,35,29.068753402571524,23.773920101975854,79.430169669949507,3425.5419696646918,686.92110254367037,0.94384605154680834,14.228329057030809,9.4002804861802858,2.4617978884779679,0.13963023157591051,4.4079306751030117E-3,1.6446125224090236,3.8864981099652605E-2,1.1104280314186458E-3,null,null,null,147.82937163822851,14.403366715879187,0.41152476331083393,149.47398416063754,14.44223169697884,0.41263519134225257,2.4617978884779679,0.13963023157591051,3.9894351878831573E-3,151.93578204911552,14.581861928554751,0.41662462653013577]
[20090521,"Example 1",36,32.677047999999999,28.10498918323211,0.73057173337602443,4.9913024430800608,64.995472157443132,37.449370033954985,1.8355415782096124E-2,9.6647356391007619,11.963133253869309,31.052356109459904,22.147012104477991,0.546361315431109,10.945804953487871,138.2109260155278,27.873548845688735,3.9032242222937941E-2,8.1879723472178636,7.0945334699353824,null,null,null,null,null,null,null,null,null,36,30.068753402571524,24.322910189475227,79.066272444853126,3337.7361186857165,738.97904779034604,0.94261234199496591,14.578901509316754,9.6324514386813824,2.6620167682182538,0.17483535376785067,5.3504023303405706E-3,1.821295046093018,5.2102681302155084E-2,1.4472967028376412E-3,null,null,null,154.85917621148508,17.218243660544296,0.47828454612623045,156.68047125757809,17.270346341846452,0.47973184282906811,2.6620167682182538,0.17483535376785067,4.856537604662519E-3,159.34248802579634,17.445181695614302,0.48458838043373059]
[20090521,"Example 1",37,33.677047999999999,29.10498918323211,0.76062631644144352,4.9884628790279812,64.990911051987879,38.696808533750357,1.8812436540813524E-2,9.8993040822312093,12.207153914253656,32.052356109459907,23.147012104477994,0.58255949828065057,10.937199422222799,137.59026844329688,29.489588995195785,3.982723355966631E-2,8.4917402843814092,7.342286790854752,null,null,null,null,null,null,null,null,null,37,31.068753402571524,24.852717405626855,78.695774423039566,3252.0968421947978,789.14236554294973,0.94136032989952023,14.921138636710062,9.864163570785049,2.8623797284845804,0.21561269026617963,6.40236312476615E-3,2.0052661028173309,6.8668978508186609E-2,1.8559183380590974E-3,null,null,null,161.83168674987698,20.418794464291746,0.55185930984572285,163.83695285269431,20.487463442799932,0.55371522818378194,2.8623797284845804,0.21561269026617963,5.8273700071940441E-3,166.69933258117888,20.703076133066112,0.55954259819097596]
[20090521,"Example 1",38,34.677047999999999,30.10498918323211,0.78923804474722714,4.9854159706110295,64.985951971934583,39.887839055852368,1.9280467112119122E-2,10.130163154705841,12.43510116184909,33.052356109459907,24.147012104477994,0.61877136025673751,10.928106789587252,136.94034512983902,31.094099730992493,4.0628377987574231E-2,8.7917727250652984,7.5849802167840892,null,null,null,null,null,null,null,null,null,38,32.068753402571524,25.363890920384065,78.318798831369477,3168.6327040899746,837.09446031445623,0.94009115490030659,15.255191478609364,10.09548173875446,3.0620376897051749,0.26218750912514099,7.5608370448701692E-3,2.1960760249162163,8.9095469911124617E-2,2.3446176292401216E-3,null,null,null,168.7386153172919,24.028135713269663,0.63231936087551743,170.93469134220811,24.117231183180788,0.63466397850475753,3.0620376897051749,0.26218750912514099,6.8996712927668685E-3,173.99672903191328,24.379418692305929,0.64156364979752445]
[20090521,"Example 1",39,35.677047999999999,31.10498918323211,0.81636774679219237,4.9821512740505369,64.980574765424606,41.023669658100552,1.975943459742719E-2,10.357398107445196,12.647544152243409,34.052356109459907,25.147012104477994,0.65492489019511879,10.918510812734064,136.26120062110942,32.684104627551484,4.1434602441718239E-2,9.0879364219933176,7.8228445737995642,null,null,null,null,null,null,null,null,null,39,33.068753402571524,25.856972635757025,77.935473238789854,3087.342948281901,882.57921260963622,0.93880596296085461,15.58121968179598,10.326459830548842,3.2601822913062652,0.31469026241018377,8.8205241198818854E-3,2.3932661195744434,0.11393844898091741,2.9214986918183953E-3,null,null,null,175.57256456834736,28.065769019255619,0.7196351030578364,177.96583068792179,28.179707468236536,0.72255660174965475,3.2601822913062652,0.31469026241018377,8.0689810874406097E-3,181.22601297922807,28.494397730646721,0.73062558283709544]
[20090521,"Example 1",40,36.677047999999999,32.104989183232107,0.84198232582170407,4.9786580635878108,64.974758964878276,42.105733445949966,2.0249266224750782E-2,10.581092349802159,12.845002951723899,35.052356109459907,26.147012104477994,0.69095419148156778,10.908395127088072,135.55294482642546,34.256679146186997,4.2244830316691968E-2,9.3801206279771439,8.0561066830660089,null,null,null,null,null,null,null,null,null,40,34.068753402571524,26.332496297691332,77.545929393792363,3008.2186400865448,925.39762528162032,0.93750590345855722,15.899389531781233,10.557142318474618,3.4560459314836396,0.37314892457076076,1.0173908341008273E-2,2.5963727016929692,0.14377065269782446,3.5942663174456115E-3,null,null,null,182.3269670590459,32.546757154340959,0.81366892885852393,184.92333976073886,32.690527807038784,0.81726319517596957,3.4560459314836396,0.37314892457076076,9.3287231142690184E-3,188.37938569222248,33.063676731609547,0.8265919182902387]
[20090521,"Example 1",41,37.677047999999999,33.104989183232107,0.86605426425377485,4.9749253355849916,64.968483795150675,43.135637596673817,2.0749889407574738E-2,10.801327389395897,13.027954879008874,36.052356109459907,27.147012104477994,0.72679911807197339,10.897743261936519,134.81575269356804,35.808960358943871,4.3057984354550771E-2,9.6682349058523975,8.2849889734750803,null,null,null,null,null,null,null,null,null,41,35.068753402571524,26.790986771125226,77.1503030545299,2931.2437183607158,965.40359974968567,0.93619212623787451,16.209872253147974,10.787565597182114,3.6489014427647515,0.43748474185920067,1.161143892852754E-2,2.8049306749666534,0.1791721581788909,4.3700526385095344E-3,null,null,null,188.99602695310563,37.480977339739951,0.91417017901804754,191.80095762807227,37.660149497918844,0.91854023165655718,3.6489014427647515,0.43748474185920067,1.0670359557541479E-2,195.44985907083702,38.097634239778046,0.92921059121409866]
[20090521,"Example 1",42,38.677047999999999,34.104989183232107,0.88856115790313694,4.9709418135414998,64.961728181645896,44.115118755192569,2.1261231793530972E-2,11.018182794569361,13.19683955775699,37.052356109459907,28.147012104477994,0.76240492499306955,10.886538656872823,134.04986362083864,37.338157260978086,4.3872989560322609E-2,9.9522071252429782,8.5097091670458127,null,null,null,null,null,null,null,null,null,42,36.068753402571524,27.232959453403623,76.748733812186472,2856.3959599561776,1002.4991578669769,0.93486577864614651,16.512842545782505,11.017759139220908,3.8380614976988321,0.50751143941535914,1.3121772877168886E-2,3.0184766881537159,0.22072069783827089,5.2552547104350216E-3,null,null,null,195.5746642968513,42.872496569645293,1.0207737278486975,198.59314098500502,43.093217267483567,1.0260289825591324,3.8380614976988321,0.50751143941535914,1.2083605700365693E-2,202.43120248270387,43.600728706898927,1.0381125882594984]
[20090521,"Example 1",43,39.677047999999999,35.104989183232107,0.90948528356337988,4.9666959540793529,64.954470758412157,45.046004472158408,2.1783221302435214E-2,11.231736175101473,13.352063008092344,38.052356109459907,29.147012104477994,0.79772193383291112,10.87476467910165,133.25558060463158,38.841561329572194,4.4688776125841254E-2,10.231981631565935,8.7304800259810555,null,null,null,null,null,null,null,null,null,43,37.068753402571524,27.658919805389139,76.341364908192858,2783.6478592091953,1036.6293697347326,0.93352800257172341,16.808477327805672,11.247746494836822,4.022877819066621,0.58293774447580693,1.4692064401459679E-2,3.2365518948853302,0.26898168360186359,6.2553879907410138E-3,null,null,null,202.05846196959754,48.719110683450872,1.1330025740337413,205.29501386448288,48.988092367052737,1.1392579620244823,4.022877819066621,0.58293774447580693,1.355669173199551E-2,209.3178916835495,49.571030111528543,1.1528146537564778]
[20090521,"Example 1",44,40.677047999999999,36.104989183232107,0.92881320111596632,4.9621759539509434,64.946689876238779,45.930180257620847,2.2315786153333298E-2,11.442063177614916,13.4940010092894,39.052356109459907,30.147012104477994,0.83270521343363002,10.862404641610693,132.43326912352344,40.316557040712368,4.5504282342626733E-2,10.507517573702643,8.9475091521483545,null,null,null,null,null,null,null,null,null,44,38.068753402571524,28.069362982979474,75.928343045879089,2712.9674260300826,1067.77719622719,0.93217993150403999,17.096954659480282,11.477546158259683,4.2027402528696705,0.66337292213040533,1.6308285747048443E-2,3.458704345913886,0.32449823902873498,7.3749599779257954E-3,null,null,null,208.44361536303506,55.012081864270826,1.2502745878243369,211.90231970894894,55.336580103299561,1.2576495478022627,4.2027402528696705,0.66337292213040533,1.5076657321145576E-2,216.1050599618186,55.999953025429967,1.2727262051234083]
[20090521,"Example 1",45,41.677047999999999,37.104989183232107,0.94653538978936214,4.9573697581229093,64.93836361077382,46.769561766849449,2.2858854880298193E-2,11.649237492774263,13.623001899945072,40.052356109459907,31.147012104477994,0.8673142757759067,10.849441822211821,131.58335576231161,41.760632100642894,4.6318457484726384E-2,10.778787377715219,9.1609988312937656,null,null,null,null,null,null,null,null,null,45,39.068753402571524,28.464773554486353,75.509818197152086,2644.3189067574699,1095.9584086166872,0.93082268763497544,17.378452825440014,11.707172319146739,4.3770757494379113,0.74833489404663434,1.7955563792489197E-2,3.6844910426197295,0.38778153339425264,8.6173674087611698E-3,null,null,null,214.72688480029032,61.736098645453772,1.3719133032323061,218.41137584291005,62.123880178848026,1.3805306706410672,4.3770757494379113,0.74833489404663434,1.6629664312147428E-2,222.78845159234797,62.872215072894662,1.3971603349532147]
[20090521,"Example 1",46,42.677047999999999,38.104989183232107,0.96264591723526893,4.9522650689894361,64.929469770680058,47.566071609674289,2.3412356336815533E-2,11.853330871896752,13.739388936372482,41.052356109459907,32.147012104477994,0.90151278687839953,10.835859483451364,130.70632658182376,43.171387191006815,4.7130264642815528E-2,11.045775354883794,9.3711459155629289,null,null,null,null,null,null,null,null,null,46,40.068753402571524,28.845625291583133,75.08594340478578,2577.6634323363901,1121.216707056532,0.92945737902036896,17.65314955529886,11.936635514926602,4.5453472877236489,0.83726042598660366,1.9618517803447973E-2,3.9134796800425633,0.45930169453242647,9.9848194463570978E-3,null,null,null,220.90555067143998,68.86946914786914,1.4971623727797638,224.81903035148255,69.328770842401568,1.507147192226121,4.5453472877236489,0.83726042598660366,1.8201313608404428E-2,229.3643776392062,70.166031268388167,1.5253485058345253]
[20090521,"Example 1",47,43.677047999999999,39.104989183232107,0.97714213953792983,4.9468493567676717,64.919985905846033,48.321620273146628,2.3976219688694015E-2,12.054413151027287,13.843462298007985,42.052356109459907,33.147012104477994,0.93526829241322651,10.821640893386256,129.80272524263918,44.546545062841396,4.7938683491433945E-2,11.30847643318517,9.5781417389447832,null,null,null,null,null,null,null,null,null,47,41.068753402571524,29.212381023385625,74.656874580908408,2512.9595986052514,1143.6191249275771,0.92808509681987195,17.921221365098024,12.16594319739246,4.7070527697399891,0.92951682763302335,2.1281585413762929E-2,4.1452501067995682,0.53947954888111183,1.1478288274066209E-2,null,null,null,226.97737123584238,76.384543368198024,1.6252030503871919,231.12262134264196,76.924022917079142,1.6366813386612584,4.7070527697399891,0.92951682763302335,1.9776953779426027E-2,235.82967411238195,77.853539744712165,1.6564582924406843]
[20090521,"Example 1",48,44.677047999999999,40.104989183232107,0.99002442999564477,4.9411098711268924,64.909889315666788,49.038090662777925,2.455037439553551E-2,12.252552280878753,13.935500805984708,43.052356109459907,34.147012104477994,0.96855195765051516,10.806769347219465,128.87315089308186,45.883958847419201,4.8742712971994846E-2,11.566895002128103,9.7821720611105647,null,null,null,null,null,null,null,null,null,48,42.068753402571524,29.565492544771534,74.222770302268415,2450.1639835674205,1163.2517770069994,0.92670691263246951,18.182843004163271,12.395100224913802,4.8617239057321511,1.0244146051974499,2.2929326154168688E-2,4.3793955280971613,0.62867939966706288,1.309748749306381E-2,null,null,null,232.94054302144158,84.248345379136509,1.7551738620653439,237.31993854953873,84.877024778803573,1.7682713495584077,4.8617239057321511,1.0244146051974499,2.1341970941613539E-2,242.1816624552709,85.901439384001023,1.7896133205000213]
[20090521,"Example 1",49,45.677047999999999,41.104989183232107,1.0012959344185093,4.9350336541015407,64.89915705740907,49.717325794658045,2.51347501808988E-2,12.447814361324321,14.01576340478829,44.052356109459907,35.147012104477994,1.0013383212832607,10.791228189784727,127.91825583393604,47.18161948118123,4.9541373875136137E-2,11.821043861607386,9.9834170358273742,null,null,null,null,null,null,null,null,null,49,43.068753402571524,29.90540057132846,73.783791602855473,2389.2316065068785,1180.2159856912947,0.92532387594396504,18.438186993814462,12.624109289990379,5.0089251056921782,1.1212205375574618,2.4546694382646221E-2,4.6155234767167759,0.72720300987517017,1.4840877752554493E-2,null,null,null,238.79366373615167,92.423382829386284,1.8861914863140059,243.40918721286846,93.150585839261453,1.9010323640665603,5.0089251056921782,1.1212205375574618,2.2882051786886976E-2,248.41811231856065,94.271806376818915,1.9239144158534474]
[20090521,"Example 1",50,46.677047999999999,42.104989183232107,1.0109623507083016,4.9286075543363346,64.887765954673611,50.361119205075674,2.5729276991386114E-2,12.640263679362338,14.08449044511711,45.052356109459907,36.147012104477994,1.0336050626422293,10.775000838866994,126.93874297427469,48.437662168168764,5.0333711307073307E-2,12.070943266139929,10.182051200708656,null,null,null,null,null,null,null,null,null,50,44.068753402571524,30.232534734396697,73.340101764448235,2330.1163337089283,1194.6248005906159,0.92393701170154052,18.687423246015076,12.852971290496107,5.1482523889544138,1.2191707025218124,2.6119276063083775E-2,4.8532565754200574,0.83528490817337864,1.6705698163467574E-2,null,null,null,244.53569759558346,100.86859051409624,2.0173718102819249,249.38895417100352,101.70387542226962,2.0340775084453924,5.1482523889544138,1.2191707025218124,2.4383414050436248E-2,254.53720655995792,102.92304612479143,2.0584609224958283]
[20090521,"Example 1",51,47.677047999999999,43.104989183232107,1.0190317305806109,4.9218182427091524,64.875692605967203,50.971207682547011,2.6333884944975357E-2,12.829962749666921,14.141904797386379,46.052356109459907,37.147012104477994,1.0653327817847085,10.758070809341245,125.93536309454888,49.65037182672215,5.1118797025844924E-2,12.31662005650329,10.378243485545955,null,null,null,null,null,null,null,null,null,51,45.068753402571524,30.547313610578872,72.89186610565261,2272.7712353866114,1206.5999121365344,0.92254731802917966,18.930718751501757,13.081685651803987,5.2793323206092015,1.317483052849681,2.7633486302459018E-2,5.0922331127251903,0.95308908596500186,1.868802129343141E-2,null,null,null,250.16594296399953,109.54035801957608,2.1478501572465896,255.25817607672471,110.49344710554108,2.1665381785400211,5.2793323206092015,1.317483052849681,2.5833001036268257E-2,260.53750839733391,111.81093015839076,2.1923711795762895]
[20090521,"Example 1",52,48.677047999999999,44.104989183232107,1.0255143014250909,4.9146522293743811,64.862913393395701,51.549265966919656,2.6948504269008876E-2,13.016972356995984,14.188212818828722,47.052356109459907,38.147012104477994,1.0965047919268769,10.740421738108308,124.90891193465187,50.818187488020101,5.1895731634696421E-2,12.558106871411145,10.5721572368648,null,null,null,null,null,null,null,null,null,52,46.068753402571524,30.850144780854162,72.439251769985987,2217.1488982086898,1216.2689488212156,0.92115576409629463,19.16823732821279,13.310250606005939,5.4018209811587594,1.415369223734295,2.9076726750855864E-2,5.332107452491714,1.0807071047316272,2.0782828937146676E-2,null,null,null,255.68400220079218,118.39358901610387,2.2767997887712284,261.01610965328388,119.4742961208355,2.2975826177083749,5.4018209811587594,1.415369223734295,2.7218638917967213E-2,266.41793063444265,120.88966534456979,2.3248012566263423]
[20090521,"Example 1",53,49.677047999999999,45.104989183232107,1.0304223064565019,4.9070958822658755,64.849404491488855,52.096903099665504,2.7573065228332621E-2,13.201351599858757,14.22360519221772,48.052356109459907,39.147012104477994,1.1271069236846016,10.722037409802338,123.86022712601384,51.939705632487957,5.2663646621302448E-2,12.795441432434789,10.763950256678195,null,null,null,null,null,null,null,null,null,53,47.068753402571524,31.141424915084777,71.982427513552977,2163.2016975898518,1223.7631397393075,0.91976328815036501,19.400139421960134,13.538663433611994,5.5154029740636892,1.5120453374761729,3.0437503804094254E-2,5.5725502962464377,1.2181575870420467,2.2984105415887673E-2,null,null,null,261.08975360242852,127.38274161720214,2.4034479550415497,266.66230389867496,128.6008992042442,2.4264320604574379,5.5154029740636892,1.5120453374761729,2.8529157310871186E-2,272.17770687273867,130.11294454172037,2.4549612177683087]
[20090521,"Example 1",54,50.677047999999999,46.104989183232107,1.0337698614733248,4.8991354470944151,64.835141876166688,52.61566014737425,2.820749804415584E-2,13.383157934953326,14.248257650431373,49.052356109459907,40.147012104477994,1.1571273405893368,10.702901783240275,122.79018498790258,53.013682466373886,5.3421706233066982E-2,13.028665895914749,10.953774853685198,null,null,null,null,null,null,null,null,null,54,48.068753402571524,31.421539878255995,71.521563492845715,2110.8820336495842,1229.2153186983483,0.91837079572277713,19.626581952281448,13.766920672406583,5.6197904744735716,1.6067416513103514,3.170550998373764E-2,5.8132488157096631,1.3653870238577495,2.5284944886254618E-2,null,null,null,266.38332532925421,136.4628047852502,2.5270889775046332,272.19657414496385,137.82819180910795,2.5523739223908879,5.6197904744735716,1.6067416513103514,2.9754475024265765E-2,277.81636461943742,139.43493346041831,2.5821283974151537]
[20090521,"Example 1",55,51.677047999999999,47.104989183232107,1.0355728267034263,4.8907570688697621,64.820101333856897,53.107009056004024,2.8851732804270704E-2,13.562447221974496,14.262331598064431,50.052356109459907,41.147012104477994,1.1865563653527738,10.682999018579316,121.69969720897987,54.039035155031996,5.4169109180335982E-2,13.257826266104441,11.141777905390255,null,null,null,null,null,null,null,null,null,55,49.068753402571524,31.690864855264675,71.056831053190265,2060.1425344821687,1232.7582428129097,0.91697915801539331,19.847718197281171,13.995018297534804,5.7147223214072991,1.6987109666962545,3.2871671901542339E-2,6.0539066715552945,1.5222717964070891,2.7677669025583437E-2,null,null,null,271.56507120739786,145.59017411745504,2.6470940748628187,277.61897787895316,147.11244591386213,2.6747717438884022,5.7147223214072991,1.6987109666962545,3.0885653939931902E-2,283.33370020036045,148.8111568805584,2.7056573978283347]
[20090521,"Example 1",56,52.677047999999999,48.104989183232107,1.035848692372122,4.8819468149719132,64.804258470771657,53.572352426165345,2.9505699365332119E-2,13.739273768466006,14.265974638866494,51.052356109459907,42.147012104477994,1.2153863163646428,10.66231350514386,120.58970743579378,55.014842041793806,5.4905090160991057E-2,13.482971864251418,11.328100929808848,null,null,null,null,null,null,null,null,null,56,50.068753402571524,31.949764491477438,70.588402518343685,2010.93623011359,1234.5231967718773,0.91558921047367692,20.06369771203638,14.222951876372466,5.799963154874864,1.7872357802608265,3.392816887272853E-2,6.2942439330730062,1.6886212837654804,3.015395149581215E-2,null,null,null,276.63554829794703,154.72340037316354,2.762917863806492,282.92979223102003,156.41202165692903,2.7930718153023042,5.799963154874864,1.7872357802608265,3.1914924647514761E-2,288.72975538589492,158.19925743718986,2.8249867399498187]
[20090521,"Example 1",57,53.677047999999999,49.104989183232107,1.0346164767738795,4.872690699789934,64.78758872235197,54.013024029384106,3.0169327247950302E-2,13.913690374453292,14.259321015761753,52.052356109459907,43.147012104477994,1.2436113539215201,10.64082988987894,119.46118779026878,55.940341891875285,5.5628921201539457E-2,13.704154848750612,11.512880165583885,null,null,null,null,null,null,null,null,null,57,51.068753402571524,32.198593046629547,70.116450981732967,1963.2167002574529,1234.6388534966102,0.91420175155051031,20.274666275819651,14.450716701286243,5.8753025988549563,1.8716342068073637,3.4868426572328713E-2,6.5339969121023156,1.8641819077123785,3.2704945749339971E-2,null,null,null,281.59549612834888,163.82379466411069,2.8741016607738716,288.12949304045122,165.68797657182307,2.9068066065232117,5.8753025988549563,1.8716342068073637,3.2835687838725681E-2,294.00479563930617,167.55961077863043,2.9396422943619371]
[20090521,"Example 1",58,54.677047999999999,50.104989183232107,1.0318966357632444,4.8629747109399108,64.770067362886749,54.430289911861358,3.0842545525392822E-2,14.085748376644284,14.242491968473564,53.052356109459907,44.147012104477994,1.2712273356998753,10.618533106382406,118.31513533839014,56.814932209674218,5.633991281145815E-2,13.921429781902862,11.696246659470228,null,null,null,null,null,null,null,null,null,58,52.068753402571524,32.437694559937597,69.641150099807277,1916.9381987252114,1233.2303623749419,0.91281754166314899,20.48076586398324,14.678307903004031,5.9405544906167034,1.9512647432706201,3.5687090189481699E-2,6.7729179233834351,2.0486419543388856,3.5321413005842857E-2,null,null,null,286.44581748436013,172.85588431438677,2.9802738674894269,293.21873540774357,174.90452626872565,3.0155952804952699,5.9405544906167034,1.9512647432706201,3.364249557363138E-2,299.15928989836027,176.85579101199627,3.0492377760689013]
[20090521,"Example 1",59,55.677047999999999,51.104989183232107,1.0277109827027422,4.8527848370659132,64.751669515313438,54.825349955793953,3.1525282706726165E-2,14.255497692027806,14.215596012238748,54.052356109459907,45.147012104477994,1.2982316810032435,10.595408404463459,117.15256853217345,57.638166685168088,5.7037414949161126E-2,14.134853239179957,11.878326360256805,null,null,null,null,null,null,null,null,null,59,53.068753402571524,32.667403024560898,69.162673887958007,1872.0557570994611,1230.4186374017163,0.91143730234411258,20.682134640872064,14.90572054698065,5.9955561565627695,2.0255299699324092,3.6379981387167103E-2,7.0107749823195862,2.241637006782204,3.7993847572579731E-2,null,null,null,291.18756066470729,181.7877222296396,3.0811478344006713,298.19833564702685,184.02935923642181,3.1191416819732511,5.9955561565627695,2.0255299699324092,3.4331016439532361E-2,304.19389180358962,186.05488920635423,3.1534726984127834]
[20090521,"Example 1",60,56.677047999999999,52.104989183232107,1.0220826180155589,4.842107097219535,64.732370161206504,55.199339789001939,3.2217466615253584E-2,14.42298686073566,14.17872913967709,55.052356109459907,46.147012104477994,1.3246232433308662,10.571441380170409,115.97452364667302,58.409751831030924,5.7720817799528333E-2,14.34448345723785,12.059240218290164,null,null,null,null,null,null,null,null,null,60,54.068753402571524,32.888042569773653,68.681196519440562,1828.5252700444614,1226.3198191671406,0.9100617155852182,20.878906970590585,15.132949714853433,6.0401677345487226,2.09387930286442,3.6944043078327229E-2,7.2473514500718137,2.4427558246114849,4.0712597076858079E-2,null,null,null,295.82190310473641,190.59105969768441,3.1765176616280737,303.0692545548082,193.0338155222959,3.2172302587049315,6.0401677345487226,2.09387930286442,3.489798838107367E-2,309.10942228935693,195.12769482516032,3.2521282470860053]
[20090521,"Example 1",61,57.677047999999999,53.104989183232107,1.0150358675891227,4.8309275718045672,64.712144150959247,55.553332951625123,3.2919024263119906E-2,14.588263088062499,14.131974946518552,56.052356109459907,47.147012104477994,1.3504021908330239,10.546618006225833,114.78205123322549,59.129542876657567,5.8389552364433779E-2,14.550380017234636,12.23910428984394,null,null,null,null,null,null,null,null,null,61,55.068753402571524,33.099927649408073,68.196892127711138,1786.303564407197,1221.044886539933,0.90869142337244635,21.07121344285278,15.359990572828849,6.0742715424750546,2.1558109209742726,3.7377275636129519E-2,7.4824456349093635,2.6515465118384318,4.3467975603908721E-2,null,null,null,300.35013627965509,199.24139765473498,3.2662524205694261,307.83258191456446,201.89294416657341,3.3097203961733346,6.0742715424750546,2.1558109209742726,3.5341162638922501E-2,313.90685345703952,204.04875508754768,3.3450615588122572]
[20090521,"Example 1",62,58.677047999999999,54.104989183232107,1.006596229362936,4.8192324350635296,64.690966214164007,55.888343244241497,3.3629881722963502E-2,14.75137228556382,14.075404680527207,57.052356109459907,48.147012104477994,1.3755698942363106,10.520924662802534,113.57621260936661,59.797538988607641,5.9043090869136963E-2,14.752603560298864,12.418029845647162,null,null,null,null,null,null,null,null,null,62,56.068753402571524,33.303363235301404,67.70993461257018,1745.3484540554591,1214.6993959590918,0.9073270274078995,21.259180911497349,15.586838428620876,6.0977714928391453,2.2108729938346818,3.7678667710664006E-2,7.7158703578142855,2.8675228262257471,4.6250368164931402E-2,null,null,null,304.77365180236245,207.71793461009116,3.3502892679046963,312.48952216017676,210.58545743631691,3.3965396360696278,6.0977714928391453,2.2108729938346818,3.5659241836043257E-2,318.58729365301593,212.79633043015158,3.4321988779056709]
[20090521,"Example 1",63,59.677047999999999,55.104989183232107,0.99679032751082475,4.8070079890723685,64.668810970195452,56.205327195159455,3.4349963997491587E-2,14.912359111171016,14.009077211543397,58.052356109459907,49.147012104477994,1.4001288218400567,10.494348168569104,112.35807640491163,60.413877889167679,5.9680946988725163E-2,14.951215532261843,12.596123482943767,null,null,null,null,null,null,null,null,null,63,57.068753402571524,33.498645014631244,67.220497450481474,1705.6187822074842,1207.3833283744812,0.90596908901378315,21.442932543562311,15.813488778368406,6.1105925528571765,2.2586643342574679,3.7848124361940086E-2,7.9474524894869196,3.0901704964438377,4.9050325340378377E-2,null,null,null,309.09392863530775,216.00343082171179,3.4286258860589172,317.04138112479467,219.09360131815563,3.4776762113992956,6.1105925528571765,2.2586643342574679,3.5851814829483616E-2,323.15197367765182,221.35226565241311,3.5135280262287796]
[20090521,"Example 1",64,60.677047999999999,56.104989183232107,0.98564587369488477,4.7942406991985065,64.64565293900084,56.505186596088187,3.507919488784695E-2,15.071267008281007,13.93303891903828,59.052356109459907,50.147012104477994,1.4240824412028261,10.466875811929356,111.12871518257991,60.978829945869336,6.0302675900020218E-2,15.146277955012341,12.773487240506991,null,null,null,null,null,null,null,null,null,64,58.068753402571524,33.686059590156141,66.728753509412485,1667.074452830039,1199.1910259855597,0.90461812921213292,21.622587877085497,16.03993734479015,6.1126802497117296,2.2988345937837078,3.7886394766332529E-2,8.177032465114582,3.3189534296449592,5.1858647338202488E-2,null,null,null,313.31252134020008,224.08400826042356,3.5013126290691181,321.48955380531464,227.40296169006851,3.5531712764073204,6.1126802497117296,2.2988345937837078,3.5919290527870434E-2,327.60223405502637,229.70179628385222,3.5890905669351909]
[20090521,"Example 1",65,61.677047999999999,57.104989183232107,0.97319163492648542,4.7809172309656311,64.621466552100742,56.788771065120535,3.5817496861616317E-2,15.228138243790518,13.847323491876928,60.052356109459907,51.147012104477994,1.4474351271552848,10.438495382375399,109.8892021502911,61.492791804998014,6.0907874165471415E-2,15.337853222058767,12.950218716077416,null,null,null,null,null,null,null,null,null,65,59.068753402571524,33.865884682495391,66.234874868518105,1629.6764525185804,1190.2112029652556,0.90327462897291233,21.798262886037637,16.266180107687372,6.1040002204370216,2.331084111147522,3.77950013293036E-2,8.4044637825476052,3.5533197092389077,5.4666457065213968E-2,null,null,null,317.43104929371941,231.94890474508173,3.5684446883858727,325.83551307626703,235.50222445432064,3.6231111454510869,6.1040002204370216,2.331084111147522,3.5862832479192648E-2,331.93951329670404,237.83330856546817,3.6589739779302795]
[20090521,"Example 1",66,62.677047999999999,58.104989183232107,0.95945740761928178,4.7670244882563315,64.596226163802982,57.056880604189153,3.6564790921305809E-2,15.383013945057641,13.751951633047144,61.052356109459907,52.147012104477994,1.470192075792669,10.409195201869887,108.64060798088089,61.956279641470694,6.1496179456539748E-2,15.526003916091545,13.126411185733556,null,null,null,null,null,null,null,null,null,66,60.068753402571524,34.038389333684634,65.739032642965071,1593.3868641235767,1180.5270162841266,0.90193902962215444,21.970070051004946,16.492213327774301,6.0845378059137909,2.355163514374484,3.7576171653369572E-2,8.629612488870098,3.7927073002395124,5.7465262124841099E-2,null,null,null,321.45118680157788,239.59019872761365,3.6301545261759642,330.080799290448,243.38290602785315,3.6876197883008053,6.0845378059137909,2.355163514374484,3.5684295672340667E-2,336.16533709636178,245.73806954222763,3.7233040839731459]
[20090521,"Example 1",67,63.677047999999999,59.104989183232107,0.94447399746077576,4.7525496527707896,64.569906062632654,57.310268125073073,3.7320996474078563E-2,15.535934135782206,13.646930659846726,62.052356109459907,53.147012104477994,1.4923592241165127,10.378964156168889,107.38399775351644,62.369922096048121,6.2067270124940392E-2,15.710792646528274,13.302153724739501,null,null,null,null,null,null,null,null,null,67,61.068753402571524,34.203834111334785,65.241396814170514,1558.1688732506402,1170.216184544701,0.90061173340098111,22.138118434422555,16.718033564701624,6.0542976884001742,2.3708731673193699,3.7232774473455021E-2,8.8523566597536938,4.036549396820341,6.0247005922691658E-2,null,null,null,325.37465404735076,247.00251887334667,3.6866047593036817,334.22701070710445,251.03906827016701,3.7468517652263733,6.0542976884001742,2.3708731673193699,3.5386166676408509E-2,340.28130839550465,253.40994143748637,3.7822379319027815]
[20090521,"Example 1",68,64.677047999999999,60.104989183232107,0.92827320476286712,4.7374802246465064,64.542480482979471,57.549641923816672,3.8086031203513365E-2,15.686937770804875,13.532253987327291,63.052356109459907,54.147012104477994,1.5139431750111814,10.347791725992945,106.12042802953957,62.734452968774875,6.2620864630839199E-2,15.892281905200598,13.477531329446791,null,null,null,null,null,null,null,null,null,68,62.068753402571524,34.362471312802064,64.742136065702411,1523.9867686380248,1159.3511443837142,0.89929310416564734,22.302513759322672,16.943637690037722,6.0133035719669339,2.3780625417618166,3.6768260384453799E-2,9.0725858754387865,4.2842793631323568,6.300410828135819E-2,null,null,null,329.20320881641902,254.18275008133671,3.7379816188431869,338.27579469185781,258.46702944446906,3.8009857271245449,6.0133035719669339,2.3780625417618166,3.4971507967085536E-2,344.28909826382477,260.8450919862309,3.8359572350916307]
[20090521,"Example 1",69,65.677047999999999,61.104989183232107,0.91088781497825688,4.7218040641302865,64.513923616964306,57.775668088236777,3.8859810944101215E-2,15.836062769830365,13.407900479535581,64.052356109459907,55.147012104477994,1.5349511272560843,10.315668017950291,104.85094407387234,63.050703734885047,6.3156720837698341E-2,16.070533938500663,13.652625039857162,null,null,null,null,null,null,null,null,null,69,63.068753402571524,34.514545168848173,64.24141762506531,1490.8059373026779,1147.9992354951712,0.89798346821820041,22.463358490701999,17.169022895882968,5.9615979051259949,2.3766295871176291,3.6186607947385652E-2,9.2902006966933168,4.5353352335945161,6.5729496139050964E-2,null,null,null,332.93863893910049,261.12974512224457,3.784489059742675,342.2288396357938,265.66508035583911,3.8502185558817263,5.9615979051259949,2.3766295871176291,3.4443907059675781E-2,348.19043754091979,268.04170994295674,3.8846624629414022]
[20090521,"Example 1",70,66.677047999999999,62.104989183232107,0.89235159408854947,4.7055094341799544,64.484209626525328,57.988972827175672,3.9642249559152805E-2,15.983346050086539,13.273833649102887,65.052356109459907,56.147012104477994,1.5553908102891776,10.282583795112966,103.57657723149231,63.319595946276443,6.3674635183939537E-2,16.245610634452891,13.827512062480526,null,null,null,null,null,null,null,null,null,70,64.068753402571517,34.660292046332735,63.739407111570273,1458.5928552443108,1136.2229066704319,0.89668311525690769,22.620751918739135,17.394186699714311,5.8992416448337845,2.3665201617022777,3.5492275568382657E-2,9.5051121436526707,4.7891637525033213,6.8416625035761736E-2,null,null,null,336.58275540064614,267.8440487775847,3.8263435539654957,346.08786754429883,272.63321253008803,3.8947601790012576,5.8992416448337845,2.3665201617022777,3.3807430881461112E-2,351.98710918913264,274.99973269179031,3.9285676098827187]
[20090521,"Example 1",71,67.677047999999999,63.104989183232107,0.87269928858133261,4.6885850438590539,64.453312655724318,58.190144713432609,4.0433258822739813E-2,16.128823557934091,13.130000680787205,66.052356109459907,57.147012104477994,1.5752704234515256,10.248530507143579,102.298342466854,63.542133578111546,6.4174441741936261E-2,16.417573423311183,14.002265893148024,null,null,null,null,null,null,null,null,null,71,65.068753402571517,34.799940649536332,63.236268390461809,1427.3150744054294,1124.0799364470884,0.89539229943532395,22.774790243199725,17.619126945987471,5.8263140609038686,2.3477275824948549,3.4690159394878677E-2,9.7172411800408511,5.0452239447628786,7.1059492179758849E-2,null,null,null,340.13738606915689,274.32763933001371,3.8637695680283621,349.85462724919773,279.37286327477659,3.9348290602081208,5.8263140609038686,2.3477275824948549,3.306658566894162E-2,355.68094131010162,281.72059085727142,3.967895645877062]
[20090521,"Example 1",72,68.677047999999999,64.104989183232107,0.85196662973712645,4.6710200923738592,64.4212068432726,58.379736834981621,4.1232748306243294E-2,16.272530299445751,12.976331248377312,67.052356109459907,58.147012104477994,1.5945985794562558,10.213500319867851,101.01723607251446,63.719395376235752,6.4656011175073413E-2,16.586483190405094,14.176956439464398,null,null,null,null,null,null,null,null,null,72,66.068753402571517,34.933712219762477,62.732163433452122,1396.9412065027848,1111.6236630141709,0.8941112405186834,22.925566658463808,17.843841804963063,5.7429125796683227,2.3202923446013148,3.3785557361191688E-2,9.9265182049098684,5.3029902197540224,7.3652641941028094E-2,null,null,null,343.60436999571459,280.58369052230466,3.896995701698676,353.53088820062447,285.88668074205867,3.970648343639704,5.7429125796683227,2.3202923446013148,3.2226282563907152E-2,359.27380078029279,288.20697308666001,4.002874626203611]
[20090521,"Example 1",73,69.677047999999999,65.104989183232107,0.83019034194241914,4.6528043135879891,64.387866335275959,58.558268851253388,4.2040625270028609E-2,16.414500369975951,12.81273608653016,68.052356109459907,59.147012104477994,1.6133842518382422,10.177486144186064,99.73423355163915,63.85252725698588,6.5119249603722798E-2,16.75240020007088,14.351650142606671,null,null,null,null,null,null,null,null,null,73,67.068753402571517,35.061820732911386,62.227252185786902,1367.4409042718037,1098.9032189463071,0.89284012512624866,23.073171438692835,18.068329769168336,5.6491526654700515,2.2843020571350872,3.2784139436204118E-2,10.132882553707772,5.5619550188563167,7.6191164641867357E-2,null,null,null,346.98555224406789,286.61635568221942,3.9262514477016359,357.11843479777565,292.17831070107576,4.0024426123435033,5.6491526654700515,2.2843020571350872,3.129180900185051E-2,362.76758746324572,294.46261275821087,4.0337344213453541]
[20090521,"Example 1",74,70.677047999999999,66.104989183232107,0.80740815473141681,4.6339280208362519,64.353265298197016,58.726228953002604,4.2856794560713403E-2,16.554766982744194,12.639105269103885,69.052356109459907,60.147012104477994,1.6316367261532689,10.140481664214688,98.450287677524372,63.942734806665221,6.5564097390983622E-2,16.915384029606813,14.526410098198347,null,null,null,null,null,null,null,null,null,74,68.068753402571517,35.184473094758275,61.721692439944981,1338.7848405993154,1085.9637671443536,0.89157910804830287,23.2176920227264,18.292589647858261,5.5451677382350404,2.2398916389971797,3.1691924074095171E-2,10.336282010193363,5.8216310239864368,7.8670689513330228E-2,null,null,null,350.2827792100814,292.43057458818492,3.9517645214619583,360.61906122027477,298.25220561217134,4.0304352109752886,5.5451677382350404,2.2398916389971797,3.0268805932394321E-2,366.1642289585098,300.4920972511685,4.0607040169076827]
[20090521,"Example 1",75,71.677047999999999,67.104989183232107,0.78365881823578221,4.614382151846117,64.317377932033352,58.884075725671593,4.3681158514440661E-2,16.693362496456732,12.455306132645228,70.052356109459907,61.147012104477994,1.6493655547073114,10.102481364548353,97.166326731807956,63.991275923556621,6.5990527858943368E-2,17.075493512286599,14.701296176009111,null,null,null,null,null,null,null,null,null,75,69.068753402571517,35.301869333704339,61.215639716049267,1310.9446859607003,1072.8467350556941,0.89032831362661602,23.359213098363188,18.516620559796877,5.4311091249455865,2.1872438159725545,3.0515260840158407E-2,10.536672330454323,6.0815529498366798,8.1087372664489066E-2,null,null,null,353.49789439387752,298.03190279863622,3.9737587039818165,364.03456672433185,304.11345574847292,4.0548460766463057,5.4311091249455865,2.1872438159725545,2.9163250879634058E-2,369.46567584927743,306.30069956444549,4.0840093275259397]
[20090521,"Example 1",76,72.677047999999999,68.104989183232107,0.75898212168748957,4.5941583135624944,64.280178483708568,59.032239917252426,4.4513616866513339E-2,16.830318441992436,12.26118076689715,71.052356109459907,62.147012104477994,1.6665805146079007,10.063480556531552,95.883252921640448,63.999453640880212,6.639854594602014E-2,17.232786688550572,14.876365138250542,null,null,null,null,null,null,null,null,null,76,70.068753402571517,35.414202790800495,60.709247149046071,1283.8930845248403,1059.5900448445852,0.88908783718746653,23.497816685735295,18.740421924641712,5.3071460422912695,2.1265899595449711,2.9260819172855935E-2,10.734016780052022,6.3412789464326824,8.3437880874114245E-2,null,null,null,356.63273459013192,303.42636255054265,3.9924521388229297,367.36675137018392,309.76764149697533,4.0758900196970442,5.3071460422912695,2.1265899595449711,2.7981446836118039E-2,372.67389741247518,311.89423145652029,4.1038714665331613]
[20090521,"Example 1",77,73.677047999999999,69.104989183232107,0.73341891457371577,4.5732488266596487,64.241641260673504,59.171126112495003,4.5354066667697458E-2,16.965665548178894,12.056542972119606,72.052356109459907,63.147012104477994,1.6832915689403591,10.0234754034294,94.60194097479112,63.968609164651689,6.6788186815687753E-2,17.387320764573182,15.051670756257668,null,null,null,null,null,null,null,null,null,77,71.068753402571517,35.521660306872349,60.202665382685765,1257.6036292431118,1046.2283376922446,0.88785774651661487,23.633582219534542,18.963993453181107,5.1734656070858565,2.058211307693508,2.7935583245592414E-2,10.928285685109119,6.6003916413383115,8.5719371965432611E-2,null,null,null,359.68912646438918,308.62031391190874,4.0080560248299832,370.61741214949831,315.22070555324706,4.093775396795416,5.1734656070858565,2.058211307693508,2.6730016983032571E-2,375.79087775658417,317.27891686094057,4.1205054137784494]
[20090521,"Example 1",78,74.677047999999999,70.104989183232107,0.70701112998296523,4.5516467695131082,64.201740644714064,59.301114315952034,4.6202402207444662E-2,17.099433766686161,11.84117455370273,73.052356109459907,64.147012104477994,1.6995088308820121,9.9824629443871,93.323236910448443,63.90011515599312,6.7159514426532688E-2,17.539152077477556,15.227263925365349,null,null,null,null,null,null,null,null,null,78,72.068753402571517,35.624422406600367,59.696042470318396,1232.050836196988,1032.7931908379421,0.88663808336602268,23.766586629890828,19.18733513664365,5.03027287017186,1.9824406084247623,2.6546852902176347E-2,11.119455997972372,6.8584988524830859,8.7929472467731876E-2,null,null,null,362.66888348549213,313.62034461154309,4.0207736488659371,373.78833948346448,320.47884346402617,4.1087031213336687,5.03027287017186,1.9824406084247623,2.5415905236214901E-2,378.81861235363635,322.46128407245095,4.1341190265698842]
[20090521,"Example 1",79,75.677047999999999,71.104989183232107,0.67980180960670022,4.5293460213945895,64.160451105960973,59.42256144682522,4.7058514944237323E-2,17.231652296064958,11.614820785189007,74.052356109459907,65.147012104477994,1.7152425305773118,9.9404411170688523,92.047956982374671,63.795369283146059,6.7512620073195709E-2,17.68833606653347,15.403192777806598,null,null,null,null,null,null,null,null,null,79,73.068753402571517,35.722663479432164,59.189523782497417,1207.2101184416417,1019.3133263353687,0.8854288649825669,23.896904421739599,19.41044723527277,4.8777908684452873,1.8996642275616018,2.510225065282147E-2,11.307510877920619,7.1152340033337218,9.0066253206755972E-2,null,null,null,365.57380318632516,318.43317683286858,4.0307997067451717,376.88131406424577,325.54841083620232,4.1208659599519279,4.8777908684452873,1.8996642275616018,2.4046382627362049E-2,381.75910493269106,327.44807506376395,4.1449123425792909]
[20090521,"Example 1",80,76.677047999999999,72.104989183232107,0.65183512976875424,4.5063413046445175,64.117747217097417,59.535802748916133,4.7922293443211389E-2,17.362349604956339,11.377184817335346,75.052356109459907,66.147012104477994,1.7305029846061784,9.8974087788685488,90.77688679007683,63.655788064269139,6.7847620907292613E-2,17.834927249734339,15.579502793477474,null,null,null,null,null,null,null,null,null,80,74.068753402571517,35.816551957224185,58.683251921364246,1183.0577595500722,1005.8148108018115,0.8842300856494959,24.024607752547571,19.633330266336166,4.7162606882653675,1.8103247628432815,2.3609734725876269E-2,11.492439287244379,7.3702562721311802,9.2128203401639755E-2,null,null,null,368.40566472703148,323.06558921676941,4.0383198652096173,379.89810401427587,330.43584548890061,4.1304480686112575,4.7162606882653675,1.8103247628432815,2.2629059535541018E-2,384.61436470254125,332.24617025174388,4.1530771281467986]
[20090521,"Example 1",81,77.677047999999999,73.104989183232107,0.62315642774370628,4.4826282255696723,64.073603667758675,59.641153119211751,4.8793623321164242E-2,17.491553454500188,11.127920737232236,76.052356109459907,67.147012104477994,1.7453005678867879,9.853365726586814,89.510780552767699,63.482801018109519,6.8164658446905169E-2,17.978979205205246,15.756236908430671,null,null,null,null,null,null,null,null,null,81,75.068753402571517,35.906250488528634,58.177366641769765,1159.5708870332635,992.32124568893619,0.88304171823193067,24.149766508292746,19.855984991718074,4.5459415317926526,1.7149242059425047,2.2077618165181879E-2,11.674235602899021,7.6232505063119742,9.411420378162931E-2,null,null,null,371.16622673669553,327.52435234588171,4.0435105227886634,382.84046233959458,335.1476028521937,4.1376247265702926,4.5459415317926526,1.7149242059425047,2.1171903777067961E-2,387.38640387138724,336.86252705813621,4.1587966303473607]
[20090521,"Example 1",82,78.677047999999999,74.104989183232107,0.59381222749305473,4.458203313808184,64.027995279118144,59.738908358771198,4.967238719901481E-2,17.619290919968705,10.866624878755452,77.052356109459907,68.147012104477994,1.7596456878625295,9.8083127144720237,88.250360540121392,63.277845135836422,6.8463897082706587E-2,18.120544556941876,15.933435620975708,null,null,null,null,null,null,null,null,null,82,76.068753402571517,35.991916109457868,57.672004779069589,1136.7274457861251,978.85394781035245,0.8818637157182786,24.272448377620158,20.07841240522459,4.3671107756222902,1.6140276914588039,2.0514593931622905E-2,11.852899243822428,7.8739269321528065,9.60234991725952E-2,null,null,null,373.85722541120896,331.81617605834214,4.0465387324188065,385.71012465503139,339.69010299049495,4.1425622315914019,4.3671107756222902,1.6140276914588039,1.9683264529985412E-2,390.07723543065367,341.30413068195378,4.1622454961213879]
[20090521,"Example 1",83,79.677047999999999,75.104989183232107,0.56385026379229219,4.4330640599006603,63.980897018653103,59.829346349646045,5.0558464661740583E-2,17.7455884116515,10.592824840019459,78.052356109459907,69.147012104477994,1.7735487608309417,9.7622514705262002,86.99631665315998,63.042359683748913,6.874552258821981E-2,18.259674964427592,16.111137095279933,null,null,null,null,null,null,null,null,null,83,77.068753402571517,36.073700411073368,57.167300183515259,1114.5061716864009,965.43212002896371,0.8806960127500395,24.392718924113151,20.300613719714981,4.1800640083080927,1.5082678656441084,1.8929765892482717E-2,12.028434313913888,8.1220206882403492,9.7855670942654807E-2,null,null,null,376.48037284661189,335.94766704598038,4.0475622535660287,388.50880716052575,344.06968773422074,4.145417924508684,4.1800640083080927,1.5082678656441084,1.8171901995712149E-2,392.68887116883383,345.57795559986482,4.1635898265043956]
[20090521,"Example 1",84,80.677047999999999,76.104989183232107,0.53331950354080471,4.4072089508047414,63.93228401508339,59.912728161574087,5.1451732225779784E-2,17.870471695018036,10.305965453638425,79.052356109459907,70.147012104477994,1.7870201902801295,9.7151847109812,85.749306148056846,62.777781343230075,6.9009740641134173E-2,18.396421115716411,16.289377262379361,null,null,null,null,null,null,null,null,null,84,78.068753402571517,36.151749703259718,56.663383661146568,1092.8865654537906,952.07301214205586,0.879538527133086,24.510641656640342,20.52259035415749,3.9851150298053559,1.3983498950663333,1.733268543819716E-2,12.200849260587686,8.3672912096679202,9.9610609638903808E-2,null,null,null,379.03735558872518,339.92529531738347,4.0467297061593275,391.23820484931287,348.29258652705141,4.1463403157982315,3.9851150298053559,1.3983498950663333,1.6647022560313491E-2,395.22331987911821,349.69093642211777,4.162987338358545]
[20090521,"Example 1",85,81.677047999999999,77.104989183232107,0.50227016283817782,4.3806375030910543,63.882131573475,59.989299092149693,5.2352063313852955E-2,17.993965910182602,10.005390647422281,80.052356109459907,71.147012104477994,1.8000703471054842,9.6671161528552574,84.509953495192548,62.485539691229185,6.9256775362018838E-2,18.530832723607855,16.468189918523009,null,null,null,null,null,null,null,null,null,85,79.068753402571517,36.226205175055881,56.160382921077016,1071.8488668590296,938.79207210894924,0.87839116132412831,24.626278097751403,20.744343920694945,3.782595791199983,1.2850571128908079,1.5733393215812696E-2,12.370156548744147,8.6095214879861217,0.10128848809395437,null,null,null,381.52983338124619,343.75536824021782,4.0441808028260917,393.89998992999034,352.36488972820393,4.1454692909200466,3.782595791199983,1.2850571128908079,1.5118318975185976E-2,397.68258572119032,353.64994684109473,4.1605876098952326]
[20090521,"Example 1",86,82.677047999999999,78.104989183232107,0.4707537181738245,4.3533502935615465,63.830415190500716,60.059289644102982,5.3259328237126702E-2,18.11609559069651,9.6903196710726203,81.052356109459907,72.147012104477994,1.8127095515864857,9.6180505245055237,83.278850365452683,62.167053021723405,6.948686787618262E-2,18.662958524574318,16.647606820787892,null,null,null,null,null,null,null,null,null,86,80.068753402571517,36.297203051426791,55.658422529050107,1051.3740293573494,925.60308784940037,0.87725380388669061,24.739687850109629,20.965876211793766,3.5728562468826448,1.1692572623575066,1.414246505701929E-2,12.536372349940322,8.8485172299552541,0.10288973523203784,null,null,null,383.95943809580598,347.44401101265203,4.0400466396820001,396.49581044574632,356.29252824260726,4.1429363749140382,3.5728562468826448,1.1692572623575066,1.3596014678575657E-2,400.06866669262894,357.46178550496478,4.1565323895926136]
[20090521,"Example 1",87,83.677047999999999,79.104989183232107,0.43882290981163752,4.3253489870365138,63.777110569848865,60.122916443222238,5.4173394184614906E-2,18.236884681691478,9.3598154553253394,82.052356109459907,73.147012104477994,1.8249480570099859,9.567993574098324,82.056555735504418,61.823724506040399,6.9700274903843742E-2,18.792846280132832,16.827657779915313,null,null,null,null,null,null,null,null,null,87,81.068753402571517,36.364874746467933,55.15762386713309,1031.4436952073095,912.5183199043322,0.87612633091154135,24.850928660959156,21.187189187539651,3.3562640828450858,1.0519092349373569,1.2571060524713502E-2,12.699516246491113,9.084105936122576,0.10441501076002961,null,null,null,386.32777282866977,350.99715254553774,4.0344500292590544,399.02728907516087,360.08125848166031,4.1388650400190841,3.3562640828450858,1.0519092349373569,1.2090910746406402E-2,402.38355315800595,361.13316771659765,4.1509559507654901]
[20090521,"Example 1",88,84.677047999999999,80.104989183232107,0.40653173515882268,4.2966363610643894,63.722193637770694,60.180383100337828,5.5094125219686749E-2,18.356356557397767,9.0127417527413058,83.052356109459907,74.147012104477994,1.8367960348326615,9.5169520759255839,80.84359610362921,61.456938687620863,6.9897267383197223E-2,18.920542780382149,17.008370750331061,null,null,null,null,null,null,null,null,null,88,82.068753402571517,36.429347013044058,54.658105099402334,1012.0401711242948,899.54862529739137,0.87500860739711606,24.960056484634769,21.408284963133909,3.1332042728235936,0.93407010188040274,1.1030971484509034E-2,12.859610950188754,9.3161359182250258,0.10586518088892075,null,null,null,388.63641114989707,354.42051586190541,4.0275058620671071,401.49602210008584,363.73665178013044,4.1333710429560275,3.1332042728235936,0.93407010188040274,1.0614432975913668E-2,404.62922637290944,364.67072188201087,4.1439854759319417]
[20090521,"Example 1",89,85.677047999999999,81.104989183232107,0.37393542959141896,4.2672163273187929,63.66564055875655,60.231881020654598,5.6021382283529993E-2,18.474534038059357,8.6477038957250141,84.052356109459907,75.147012104477994,1.8482635612813028,9.4649338345032135,79.640465807609516,61.068058304752391,7.0078129130405009E-2,19.046093849451793,17.189771917323998,null,null,null,null,null,null,null,null,null,89,83.068753402571517,36.49074208887091,54.159981143464741,993.146404507753,886.70357296893326,0.87390048858606495,25.067125543130146,21.629165796636229,2.9040783965294734,0.81690208323071556,9.5346665448921113E-3,13.016682035292796,9.5444752724350419,0.10724129519589935,null,null,null,390.88689649181987,357.71961223622458,4.0193214858002762,403.90357852711264,367.2640875086596,4.1265627809961751,2.9040783965294734,0.81690208323071556,9.1786750924799498E-3,406.80765692364213,368.08098959189033,4.1357414560886552]
[20090521,"Example 1",90,86.677047999999999,82.104989183232107,0.34109043187432009,4.2370939494600872,63.607427751330448,60.277590163581316,5.6955023205397866E-2,18.59143940626873,8.2629649607992572,85.052356109459907,76.147012104477994,1.8593606052952814,9.4119476863950045,78.447627436166655,60.658421433019839,7.0243155539988389E-2,19.169544352634233,17.371885781368416,null,null,null,null,null,null,null,null,null,90,84.068753402571517,36.54917783905573,53.663363647651423,974.74596027240193,873.9915511758669,0.87280182125461381,25.172188384746782,21.849834076992359,2.6693036274841191,0.70167885864124413,8.0953248274127209E-3,13.170757685414083,9.7690108235535895,0.10854456470615099,null,null,null,393.08074166466844,360.89973840167187,4.0099970933519096,406.2514993500825,370.66874922522544,4.1185416580580601,2.6693036274841191,0.70167885864124413,7.7964317626804903E-3,408.92080297756661,371.37042808386667,4.1263380898207407]
[20090521,"Example 1",91,87.677047999999999,83.104989183232107,0.30805433097069473,4.2062754572541214,63.547531903951636,60.317679756059427,5.7894902719452038E-2,18.707094422741907,7.8563238035967986,86.052356109459907,77.147012104477994,1.8700970177209402,9.3580034997140107,77.26551232551482,60.229338937671891,7.0392652328581412E-2,19.290938204992091,17.554735239585618,null,null,null,null,null,null,null,null,null,91,85.068753402571517,36.604767895118322,53.168360973710115,956.82299830593934,861.41986726335779,0.87171244495196654,25.275295940851841,22.070292312378726,2.4293112550464722,0.58979025443880195,6.726848906213197E-3,13.321868453892469,9.9896470534300192,0.10977634124648372,null,null,null,395.21942848808209,363.96597624895134,3.999626112625839,408.54129694197457,373.95562330238135,4.1094024538723222,2.4293112550464722,0.58979025443880195,6.4812115872395822E-3,410.97060819702102,374.54541355682017,4.1158836654595623]
[20090521,"Example 1",92,88.677047999999999,84.104989183232107,0.27488579069925473,4.1747682567587159,63.48592999101183,60.352308962246454,5.8840872488000302E-2,18.821520341554791,7.4249316804359893,87.052356109459907,78.147012104477994,1.880482521672765,9.3031121712621037,76.094521132726186,59.782092224801097,7.0526934324504562E-2,19.410318381253152,17.7383416643498,null,null,null,null,null,null,null,null,null,92,86.068753402571517,36.657621790520011,52.675078184817004,939.36225156917021,848.99484021948649,0.87063219318749518,25.376497580777379,22.290543118890344,2.1845445322800261,0.48274377075559771,5.4438412378769955E-3,13.470047037250751,10.20630502517103,0.11093809809968511,null,null,null,397.30440752807743,366.92319452511435,3.9882955926642865,410.7744545653282,377.1294995502854,4.0992336907639721,2.1845445322800261,0.48274377075559771,5.247214899517366E-3,412.95899909760823,377.61224332104098,4.1044809056634888]
[20090521,"Example 1",93,89.677047999999999,85.104989183232107,0.24164444838865881,4.1425809364086028,63.422599288915755,60.381627512261019,5.979278113091592E-2,18.934737924860443,6.9650053089682622,88.052356109459907,79.147012104477994,1.8905267039810658,9.2472856212778343,74.93502447778485,59.317931279151161,7.0646324305145253E-2,19.527726926823171,17.922724979052106,null,null,null,null,null,null,null,null,null,93,87.068753402571517,36.707845092732555,52.183617038721621,922.34900484875664,836.72188642309118,0.86956089456393881,25.475841164897229,22.510589209593117,1.9354555093403296,0.38216052726839878,4.2615199294740256E-3,13.61532806129334,10.41892131309795,0.11203141196879517,null,null,null,399.3370979298324,369.77605211575678,3.9760865818898581,412.95242599112572,380.19497342885472,4.0881179938586527,1.9354555093403296,0.38216052726839878,4.109252981380632E-3,414.88788150046605,380.57713395612313,4.092227246840034]
[20090521,"Example 1",94,90.677047999999999,86.104989183232107,0.20839078342470335,4.1097232688522212,63.357517392232317,60.405776292549888,6.0750474261016145E-2,19.046767457106689,6.4713551881831251,89.052356109459907,80.147012104477994,1.9002390076505116,9.1905367857720091,73.787363646442316,58.838072975498768,7.0751151883691146E-2,19.643204969762976,18.107903731044516,null,null,null,null,null,null,null,null,null,94,88.068753402571517,36.755539531883429,51.694075985834068,905.76907416791244,824.60559898942199,0.8684983738552926,25.573373095921017,22.730433383957166,1.6825002556385384,0.28976181400574219,3.1955364714314717E-3,13.757747879408912,10.627446946930236,0.11305794624393868,null,null,null,401.31888733737219,372.52900255958195,3.9630744953147015,415.07663521678109,383.15644950651222,4.0761324415586406,1.6825002556385384,0.28976181400574219,3.0825724894227892E-3,416.75913547241964,383.44621132051793,4.0792150140480627]
[20090521,"Example 1",95,91.677047999999999,87.104989183232107,0.17518595142476825,4.0762062084182444,63.290662229903099,60.424887900293761,6.1713794525171402E-2,19.157628758772464,5.9365602178443142,90.052356109459907,81.147012104477994,1.9096287252582393,9.1328796064406195,72.651851346257587,58.343699649886396,7.0841752446348244E-2,19.756792733591805,18.293895161792879,null,null,null,null,null,null,null,null,null,95,89.068753402571517,36.80080312601757,51.20655017205894,889.60878685616854,812.64982110896415,0.86744445302848028,25.669138368446806,22.950078517684055,1.4261313322622631,0.20734018697724468,2.2616368164171765E-3,13.897344382630669,10.831846377315838,0.11401943555069304,null,null,null,403.25113189191046,375.18629950132487,3.9493294684349984,417.14847627454111,386.01814587864072,4.063348903985692,1.4261313322622631,0.20734018697724468,2.1825282839709969E-3,418.5746076068034,386.22548606561799,4.0655314322696627]
[20090521,"Example 1",96,92.677047999999999,88.104989183232107,0.14209157975180695,4.0420418841164292,63.222012081494505,60.439087164128551,6.2682581650910618E-2,19.267341199640661,5.3494000072353227,91.052356109459907,82.147012104477994,1.91870499322442,9.0743290181546854,71.528772508510684,57.835957916492568,7.091846614079074E-2,19.868529550791784,18.48071527427501,null,null,null,null,null,null,null,null,null,96,90.068753402571517,36.843730303019093,50.721131446177054,873.85496227581575,800.85771376276955,0.86639895220829866,25.763180616816044,23.169527552936977,1.1667851076370876,0.13670524779297491,1.475071236547963E-3,14.034156821004796,11.032096468594327,0.11491767154785758,null,null,null,405.13515630123698,377.75200283830713,3.9349166962323658,419.16931312224176,388.78409930690145,4.0498343677802238,1.1667851076370876,0.13670524779297491,1.4240129978434887E-3,420.33609822987887,388.92080455469443,4.0512583807780667]
[20090521,"Example 1",97,93.677047999999999,89.104989183232107,0.10916952025353864,4.0072435881056681,63.151545593479135,60.448491633324245,6.3656672498283884E-2,19.375923711625003,4.6915221183825055,92.052356109459907,83.147012104477994,1.9274767868920983,9.0149009340369712,70.418385129014965,57.315957715608768,7.0981636916240279E-2,19.978453876901149,18.66837889766569,null,null,null,null,null,null,null,null,null,97,91.068753402571517,36.884412019239306,50.237908371573447,858.49489319964289,789.23181818354863,0.86536169058547585,25.855542161315267,23.388783488979886,0.90485811456311882,7.9587261280257587E-2,8.4959190089185549E-4,14.168225635817592,11.228185523564433,0.11575448993365395,null,null,null,406.97225397311377,380.22998535817692,3.919896756269865,421.14047960893134,391.45817088174135,4.0356512462035194,0.90485811456311882,7.9587261280257587E-2,8.2048722969337723E-4,422.04533772349447,391.53775814302162,4.0364717334332125]
[20090521,"Example 1",98,94.677047999999999,90.104989183232107,7.6481555547312813E-2,3.9718257595917827,63.079241795531679,60.453212037432785,6.4635901116744596E-2,19.483394801167115,3.9290737728209972,93.052356109459907,84.147012104477994,1.9359529163568672,8.9546122281461003,69.32092114120745,56.784771578021918,7.103161161525133E-2,20.086603305094709,18.856899749355833,null,null,null,null,null,null,null,null,null,98,92.068753402571517,36.922935874879876,49.7569662421092,843.51632783204741,777.77411341621814,0.86433248726800416,25.946264052770534,23.607849373229215,0.64065568182448729,3.7466947992642982E-2,3.9573422264541861E-4,14.299592302233968,11.420112344029732,0.11653175861254829,null,null,null,408.76368720619416,382.62393970154125,3.9043259153218495,423.06327950842814,394.04405204557099,4.0208576739343975,0.64065568182448729,3.7466947992642982E-2,3.8231579584329571E-4,423.70393519025265,394.08151899356363,4.0212399897302413]
[20090521,"Example 1",99,95.677047999999999,91.104989183232107,4.4089055940303476E-2,3.9358039641486506,63.005080116824047,60.45335271829277,6.5620098806809718E-2,19.589772561220077,2.9849198563568136,94.052356109459907,85.147012104477994,1.944142022990474,8.8934807157987947,68.236587315266434,56.243434091071357,7.1068739116984608E-2,20.193014581161119,19.046290494358097,null,null,null,null,null,null,null,null,null,99,93.068753402571517,36.959386226182211,49.278387101931436,828.90745246356107,766.48606931516406,0.86331116207620573,26.035386115580685,23.826728292718993,0.37424832679367992,1.1259642738957765E-2,1.1768384345384241E-4,14.428299181904608,11.607885330009482,0.11725136696979276,null,null,null,410.51068743247168,384.93738551390953,3.8882564193324196,424.93898661437629,396.54527084391901,4.0055077863022124,0.37424832679367992,1.1259642738957765E-2,1.1373376503997743E-4,425.31323494116998,396.55653048665795,4.005621520067252]
[20090521,"Example 1",100,96.677047999999999,92.104989183232107,1.2052585253771078E-2,3.8991948684879052,62.929040402303976,60.449012036159694,6.6609094186257378E-2,19.695074682833535,1.5615993183210033,95.052356109459907,86.147012104477994,1.9520525766058159,8.8315251315718246,67.16556617739289,55.692941551741235,7.1093369531493256E-2,20.297723618794592,19.236562802154801,null,null,null,null,null,null,null,null,null,100,94.068753402571517,36.993844294475977,48.80224976901907,814.65687474711785,755.36869529844489,0.86229753628224948,26.122946989235949,24.045423365978021,0.10477823938901362,6.1009270194403221E-4,6.3106260954930296E-6,14.554389385104201,11.791521619717491,0.1179152161971749,null,null,null,412.21445550574083,387.17367667736755,3.8717367667736755,426.768844890845,398.96519829708507,3.9896519829708508,0.10477823938901362,6.1009270194403221E-4,6.1009270194403218E-6,426.87362313023402,398.96580838978701,3.9896580838978704]
[20090521,"Example 1",101,97.677047999999999,93.104989183232107,0,3.862016210734867,62.85110292894111,0,6.7602713260627167E-2,19.799318466355562,0,96.052356109459907,87.147012104477994,1.9596928732139594,8.7687651050351647,66.108016943773933,55.134251792343782,7.1105853444311626E-2,20.400765515128082,19.427727401048543,null,null,null,null,null,null,null,null,null,101,95.068753402571517,37.026388272141162,48.328629862258495,800.75360758295244,744.42258516186712,0.86129143329506119,26.208984168368186,24.263937735316713,0,0,0,14.677906641971202,11.971046271727491,0.11852521061116328,null,null,null,413.87616203097355,389.33600853428624,3.8548119656860025,428.55406867294477,401.30705480601375,3.9733371762971657,0,0,0,428.55406867294477,401.30705480601375,3.9733371762971657]
[20090521,"Example 1",102,98.677047999999999,94.104989183232107,0,3.8242867663007263,62.77124842192368,0,6.8600779497785258E-2,19.902520832264813,0,97.052356109459907,88.147012104477994,1.9670710333268302,8.7052211342784638,65.064076464144676,54.568284164645512,7.1106541210432764E-2,20.502174566442548,19.619794130078066,null,null,null,null,null,null,null,null,null,102,96.068753402571517,37.057093425539584,47.857599831847132,787.18705359798696,733.6479582387152,0.8602926792917821,26.293534041379182,24.482274559518689,0,0,0,14.798895182427989,12.146491490147682,0.11908324990340864,null,null,null,415.49694772993092,391.42742503373495,3.8375237748405389,430.29584291235892,403.57391652388264,3.9566070247439473,0,0,0,430.29584291235892,403.57391652388264,3.9566070247439473]
[20090521,"Example 1",103,99.677047999999999,95.104989183232107,0,3.7860263094733799,62.689458070789094,0,6.9603113906322484E-2,20.004698331647287,0,98.052356109459907,89.147012104477994,1.9741950007620717,8.6409145573025938,64.033860170249994,53.995919668655141,7.1095782296580562E-2,20.601984283992998,19.812771988565046,null,null,null,null,null,null,null,null,null,103,97.068753402571517,37.086032194972645,47.38922899282349,773.94699020466715,723.04469717390612,0.8593011037970969,26.376631927692735,24.700437006931203,0,0,0,14.91739962436934,12.317895893114416,0.11959122226324675,null,null,null,417.07792383869156,393.4508257465788,3.8199109295784348,431.99532346306091,405.76872163969324,3.939502151841682,0,0,0,431.99532346306091,405.76872163969324,3.939502151841682]
[20090521,"Example 1",104,100.677048,96.104989183232107,0,3.7472555708809514,62.605713545470785,0,7.0609535117560504E-2,20.105867156330461,0,99.052356109459907,90.147012104477994,1.9810725419092656,8.5758675213577504,63.01746302489147,53.418001212731717,7.1073924670531197E-2,20.700227409899853,20.00666918335973,null,null,null,null,null,null,null,null,null,104,98.068753402571517,37.113274291723158,46.923583561524438,761.0235552235257,712.61238256471916,0.85831654021190829,26.458312113675667,24.918428248947887,0,0,0,15.033464869718488,12.485303824479656,0.12005099831230438,null,null,null,418.62017253312814,395.40897270796711,3.802009352961222,433.65363740284664,407.89427653244678,3.9220603512735268,0,0,0,433.65363740284664,407.89427653244678,3.9220603512735268]
[20090521,"Example 1",105,101.677048,97.104989183232107,0,3.7079961910129202,62.519997012243863,0,7.1619859470938393E-2,20.206043148687368,0,100.05235610945991,91.147012104477994,1.987711245419262,8.5101029503188954,62.014960467626402,52.835333992166717,7.1041314236105643E-2,20.796935933058482,20.201493173854352,null,null,null,null,null,null,null,null,null,105,99.068753402571517,37.138886792239582,46.460726694773115,748.40723305337099,702.35032470425142,0.85733882629295599,26.538607887272335,25.136251453875037,0,0,0,15.147136007960148,12.648764708197568,0.12046442579235779,null,null,null,420.12474737868502,397.30449705643446,3.7838523529184234,435.27188338664519,409.95326176463203,3.9043167787107813,0,0,0,435.27188338664519,409.95326176463203,3.9043167787107813]
[20090521,"Example 1",106,102.677048,98.104989183232107,0,3.6682706700132082,62.432291149551233,0,7.2633901102565457E-2,20.305241811123157,0,101.05235610945991,92.147012104477994,1.9941185222807796,8.4436445101979984,61.026409353546995,52.248685973928787,7.0998294312350718E-2,20.892141105025797,20.397250714835323,null,null,null,null,null,null,null,null,null,106,100.06875340257152,37.162934229521746,46.000718531604726,736.08884137257974,692.25759264817384,0.85636780458508377,26.617551571396401,25.353909781173307,0,0,0,15.258458226772026,12.808332444610631,0.1208333249491569,null,null,null,421.59267380110833,399.13990544748259,3.7654708061083264,436.85113202788034,411.94823789209323,3.8863041310574835,0,0,0,436.85113202788034,411.94823789209323,3.8863041310574835]
[20090521,"Example 1",107,103.677048,99.104989183232107,0,3.6281023139875552,62.342579163692143,0,7.3651472036725063E-2,20.4034783152552,0,102.05235610945991,93.147012104477994,2.0003016062507197,8.3765165729008793,60.051848881926304,51.658788475834605,7.0945205155334715E-2,20.985873455847308,20.593947897245446,null,null,null,null,null,null,null,null,null,107,101.06875340257152,37.185478681767172,45.543616237340053,724.05951835488361,682.33304081060919,0.85540332280794029,26.695174556122637,25.571406376064875,0,0,0,15.367476729388123,12.964064847584616,0.12115948455686558,null,null,null,423.02494957505331,400.91758622656755,3.7468933292202573,438.39242630444141,413.88165107415216,3.8680528137771231,0,0,0,438.39242630444141,413.88165107415216,3.8680528137771231]
[20090521,"Example 1",108,104.677048,100.10498918323211,0,3.5875151780933101,62.250844804354081,0,7.4672382280120422E-2,20.500767510798386,0,103.05235610945991,94.147012104477994,2.0062675546067918,8.3087441783441971,59.091301511857914,51.066336829006232,7.0882383520917039E-2,21.078162809792207,20.791590186928229,null,null,null,null,null,null,null,null,null,108,102.06875340257152,37.206579858337605,45.089474049821469,712.31071038294738,672.57533328080171,0.85444523419896246,26.771507329720542,25.788744364495681,0,0,0,15.474236658339287,13.116023121240422,0.12144465853000391,null,null,null,424.422545327752,402.6398153521526,3.7281464384458576,439.8967819860913,415.755838473393,3.8495910969758609,0,0,0,439.8967819860913,415.755838473393,3.8495910969758609]
[20090521,"Example 1",109,105.677048,101.10498918323211,0,3.5465340067035598,62.157072379969669,0,7.5696439918665023E-2,20.597123934166184,0,104.05235610945991,95.147012104477994,2.0120232491930872,8.2403529950550496,58.144773862340486,50.471991113088549,7.0810162266802201E-2,21.16903830096831,20.990182461426528,null,null,null,null,null,null,null,null,null,109,103.06875340257152,37.226295183105208,44.63834332762972,700.83416024302448,662.98296603879282,0.85349339781453282,26.846579508570702,26.005926848443067,0,0,0,15.578783025229175,13.264271374873251,0.12169056307223167,null,null,null,425.78640505516228,404.3087620641013,3.7092546978357919,441.36518808039148,417.57303343897456,3.8309452609080235,0,0,0,441.36518808039148,417.57303343897456,3.8309452609080235]
[20090521,"Example 1",110,106.677048,102.10498918323211,0,3.505184170958382,62.061246772878931,0,7.6723451216614821E-2,20.692561816798005,0,105.05235610945991,96.147012104477994,2.017575397731163,8.1713692793821942,57.212257594569365,49.876376954324776,7.0728869992144366E-2,21.258528388791639,21.189729044907775,null,null,null,null,null,null,null,null,null,110,104.06875340257152,37.244679875237921,44.190272600105331,689.6218957841977,653.55428723573141,0.85254767879124083,26.92041986600373,26.222956901556604,0,0,0,15.681160646215908,13.408876174529631,0.12189887431390574,null,null,null,427.11744664823829,405.92649429636782,3.6902408572397074,442.7986072944542,419.33537047089743,3.812139731553613,0,0,0,442.7986072944542,419.33537047089743,3.812139731553613]
[20090521,"Example 1",111,107.677048,103.10498918323211,0,3.4634916040346191,61.963353454278192,0,7.7753220717857133E-2,20.787095093222199,0,106.05235610945991,97.147012104477994,2.0229305353710112,8.1018198334536056,56.293730274493214,49.280086377216755,7.0638830712962009E-2,21.346660873288922,21.390233741287037,null,null,null,null,null,null,null,null,null,111,105.06875340257152,37.261787027483315,43.745307619002183,678.66621902577845,644.28751569237352,0.85160794856918087,26.993056360100301,26.439837565121966,0,0,0,15.781414082882364,13.549906129626528,0.12207122639303178,null,null,null,428.41656242716493,407.49498383584449,3.6711259805031036,444.19797651004728,421.04488996547104,3.7931972068961355,0,0,0,444.19797651004728,421.04488996547104,3.7931972068961355]
[20090521,"Example 1",112,108.677048,104.10498918323211,0,3.4214827344805254,61.863378498935482,0,7.8785551349167066E-2,20.880737408865226,0,107.05235610945991,98.147012104477994,2.0280950264580064,8.0317319620197569,55.389156213962934,48.683678701116179,7.0540363571596792E-2,21.433462910214569,21.591699865619756,null,null,null,null,null,null,null,null,null,112,106.06875340257152,37.277667682010005,43.303491411607297,667.95969569677698,635.1807577581767,0.85067408507923614,27.06451616048998,26.656571844335719,0,0,0,15.879587588190974,13.687431512940044,0.12220920993696469,null,null,null,429.68461968159289,409.01611123149678,3.6519295645669354,445.56420726978388,422.70354274443685,3.7741387745039003,0,0,0,445.56420726978388,422.70354274443685,3.7741387745039003]
[20090521,"Example 1",113,109.677048,105.10498918323211,0,3.37918441797405,61.761308599653752,0,7.9820244525253811E-2,20.973502127615024,0,108.05235610945991,99.147012104477994,2.0330750664935349,7.9611334283264057,54.49848728906538,48.087681473712948,7.0433782578467302E-2,21.518961025965282,21.794130273833918,null,null,null,null,null,null,null,null,null,113,107.06875340257152,37.29237090386529,42.864864335165358,657.49514519159152,626.23202266279304,0.84974597289627884,27.134825674185286,26.873162704879771,0,0,0,15.975725057230333,13.821523912257376,0.12231437090493254,null,null,null,430.92246121507844,410.49167045963316,3.6326696500852491,446.89818627230875,424.31319437189052,3.7549840209901815,0,0,0,446.89818627230875,424.31319437189052,3.7549840209901815]
[20090521,"Example 1",114,110.677048,106.10498918323211,0,3.336623867872202,61.657131081461486,0,8.0857100255421935E-2,21.065402339148395,0,109.05235610945991,100.14701210447799,2.0378766842685407,7.8900524091639346,53.62166373447144,47.49259143398924,7.0319396384375357E-2,21.603181132278827,21.997527390871102,null,null,null,null,null,null,null,null,null,114,108.06875340257152,37.305943852107383,42.429464132451507,647.26563092640652,617.43923648191037,0.84882350336020274,27.204010570486471,27.089613069783802,0,0,0,16.069869982474192,13.952255911975303,0.12238820975416932,null,null,null,432.13090589210509,411.923373352466,3.6133629241444387,448.20077587457928,425.87562926444133,3.7357511338986082,0,0,0,448.20077587457928,425.87562926444133,3.7357511338986082]
[20090521,"Example 1",115,111.677048,107.10498918323211,0,3.2938285849244782,61.550833915511511,0,8.1895917251678024E-2,21.156450866030095,0,110.05235610945991,101.14701210447799,2.0425057441506564,7.8185174492426111,52.758614912851328,46.898875497794727,7.0197508081643531E-2,21.68614854070497,22.201893237304645,null,null,null,null,null,null,null,null,null,115,109.06875340257152,37.318431848669924,41.997325988343611,637.26445108116354,608.80025483017698,0.8479065746666784,27.272095804990954,27.305925816563892,0,0,0,16.162065413284616,14.079700802933763,0.1224321808950762,null,null,null,433.31074918619834,413.31285379803194,3.5940248156350605,449.47281459948294,427.3925546009657,3.7164569965301366,0,0,0,449.47281459948294,427.3925546009657,3.7164569965301366]
[20090521,"Example 1",116,112.677048,108.10498918323211,0,3.250826286525474,61.442405732668256,0,8.2936493038120118E-2,21.246660270592297,0,111.05235610945991,102.14701210447799,2.0469679485069352,7.7465574150449816,51.909260058617896,46.306971759769901,7.0068415032397025E-2,21.767887976838747,22.407229454501461,null,null,null,null,null,null,null,null,null,116,110.06875340257152,37.329878445016064,41.568482587248241,627.48512971232253,600.31287438532809,0.84699509192948286,27.339105642740932,27.522103774626011,0,0,0,16.252353919403408,14.203932318794726,0.12244769240340281,null,null,null,434.46276372780483,414.66167172020914,3.5746695837949063,450.71511764720822,428.86560403900387,3.6971172761983091,0,0,0,450.71511764720822,428.86560403900387,3.6971172761983091]
[20090521,"Example 1",117,113.677048,109.10498918323211,0,3.2076448358804175,61.331835836763616,0,8.3978624061448195E-2,21.3360428616019,0,112.05235610945991,103.14701210447799,2.0512688402454846,7.6742014483073389,51.073508995446865,45.717290505891718,6.993240872233368E-2,21.848423594307928,22.613537328392923,null,null,null,null,null,null,null,null,null,117,111.06875340257152,37.340325486638726,41.142964171242859,617.92140822207091,591.97484333965042,0.84608896721621807,27.405063680540756,27.738149722922405,0,0,0,16.340777558187252,14.325024397309308,0.12243610595990861,null,null,null,435.58769985071302,415.97131684794988,3.5553104004098279,451.92847740890028,430.29634124525921,3.6777465063697368,0,0,0,451.92847740890028,430.29634124525921,3.6777465063697368]
[20090521,"Example 1",118,114.677048,110.10498918323211,0,3.1643121714529499,61.219114217502138,0,8.5022105802445416E-2,21.424610700723257,0,113.05235610945991,104.14701210447799,2.0554138054604967,7.601478919282127,50.251262827195525,45.130215231440168,6.9789774638373325E-2,21.927778988507942,22.820817811918602,null,null,null,null,null,null,null,null,null,118,112.06875340257152,37.349813175462941,40.720798598800648,608.56723716999693,583.78387086743123,0.84518811955918127,27.469992868475316,27.954066387850123,0,0,0,16.427377845353284,14.443050964859495,0.1223987369903347,null,null,null,436.68628613592915,417.24321228308196,3.5359594261278131,453.11366398128246,431.68626324794144,3.6583581631181477,0,0,0,453.11366398128246,431.68626324794144,3.6583581631181477]
[20090521,"Example 1",119,115.677048,111.10498918323211,0,3.12085623705654,61.104231562995899,0,8.6066732888275169E-2,21.512375608783724,0,114.05235610945991,105.14701210447799,2.0594080761662923,7.5284193799324184,49.442414602001605,44.546103659688349,6.964079216862E-2,22.005977210079291,23.029071546204548,null,null,null,null,null,null,null,null,null,119,113.06875340257152,37.358380130205518,40.302011403971981,599.41676841373931,575.73763569018638,0.84429247494310489,27.533915530659257,28.169856441379665,0,0,0,16.51219572901293,14.558085742711246,0.12233685498076677,null,null,null,437.75922995202444,418.47871787609523,3.5166278813117247,454.27142568103739,433.03680361880646,3.6389647362924911,0,0,0,454.27142568103739,433.03680361880646,3.6389647362924911]
[20090521,"Example 1",120,116.677048,112.10498918323211,0,3.0773049129402241,60.987179271909731,0,8.7112299205452853E-2,21.599349171848669,0,115.05235610945991,106.14701210447799,2.0632567331070684,7.4550525172077693,48.646849949482366,43.965288757089617,6.9485734523123774E-2,22.083040778123067,23.238298880536785,null,null,null,null,null,null,null,null,null,120,114.06875340257152,37.366063444746473,39.886625855900824,590.46434756547842,567.83379381497923,0.84340196627142339,27.596853385245769,28.385522499403322,0,0,0,16.595271566782291,14.670202073473071,0.12225168394560892,null,null,null,438.80721799107147,419.67913341927232,3.4973261118272694,455.40248955785376,434.34933549274541,3.6195777957728783,0,0,0,455.40248955785376,434.34933549274541,3.6195777957728783]
[20090521,"Example 1",121,117.677048,113.10498918323211,0,3.0336859482055578,60.867949465197917,0,8.8158598013347439E-2,21.685542747112724,0,116.05235610945991,107.14701210447799,2.0669647086300302,7.3814081065484221,47.864447691084912,43.388079741188704,6.9324868673979245E-2,22.158991693152039,23.448499891188405,null,null,null,null,null,null,null,null,null,121,115.06875340257152,37.372898744565951,39.474663018562048,581.70450675163045,560.06998551525294,0.8425165333126734,27.658827563722692,28.60106712029183,0,0,0,16.676645105767967,14.779472766315218,0.1221444030273985,null,null,null,439.83091679937905,420.8457016663836,3.4780636501354016,456.50756190514704,435.62517443269883,3.6002080531628002,0,0,0,456.50756190514704,435.62517443269883,3.6002080531628002]
[20090521,"Example 1",122,118.677048,114.10498918323211,0,2.9900268948754998,60.746534997413207,0,8.9205422058077466E-2,21.770967468613996,0,117.05235610945991,108.14701210447799,2.0705367896105202,7.3075159657616675,47.095080423753387,42.814763077905162,6.9158455313359374E-2,22.233851449775258,23.659674399156529,null,null,null,null,null,null,null,null,null,122,116.06875340257152,37.378920241299411,39.066141810609324,573.13195766348281,552.44384161805056,0.84163612262856313,27.719858629523046,28.816492803649091,0,0,0,16.756355465237032,14.885969959569161,0.12201614720958329,null,null,null,440.83097330233147,421.97961118795649,3.4588492720324302,457.58732876756852,436.86558114752563,3.5808654192420133,0,0,0,457.58732876756852,436.86558114752563,3.5808654192420133]
[20090521,"Example 1",123,119.677048,115.10498918323211,0,2.9463550439170412,60.622929467569811,0,9.0252563686666717E-2,21.855634252776603,0,118.05235610945991,109.14701210447799,2.07397762041865,7.2334059094099539,46.338615077176698,42.245603465232882,6.8986748828132397E-2,22.307641049115343,23.871821986864596,null,null,null,null,null,null,null,null,null,123,117.06875340257152,37.384160785463152,38.661079065231121,564.74158488697526,544.95298915643184,0.84076068748520083,27.779966595975271,29.031801989254312,0,0,0,16.834441121789709,14.989764999393705,0.12186800812515207,null,null,null,441.80801532270186,423.08199907085043,3.4396910493565076,458.64245644449159,438.07176407024411,3.5615590574816594,0,0,0,458.64245644449159,438.07176407024411,3.5615590574816594]
[20090521,"Example 1",124,120.677048,116.10498918323211,0,2.9026973634986972,60.497127229541938,0,9.1299814961327885E-2,21.939553803788314,0,119.05235610945991,110.14701210447799,2.077291705917748,7.1591077038462609,45.594913444975639,41.680844800773073,6.8809997289776367E-2,22.380381010957898,24.084942013881889,null,null,null,null,null,null,null,null,null,124,118.06875340257152,37.388651917401283,38.259489589917024,556.52843950024373,537.59505644119031,0.83989018774889579,27.839170943618736,29.246997056181318,0,0,0,16.910939896862285,15.090928333261051,0.12170103494565364,null,null,null,442.76265209190069,424.15395347057893,3.4205963989562815,459.67359198876295,439.24488180383997,3.5422974339019353,0,0,0,459.67359198876295,439.24488180383997,3.5422974339019353]
[20090521,"Example 1",125,121.677048,117.10498918323211,0,2.8590804397412111,60.369123401980026,0,9.2346967773750191E-2,22.022736618818573,0,120.05235610945991,111.14701210447799,2.0804834144857307,7.0846510230264492,44.863832690260608,41.120711130859121,6.8628442458359945E-2,22.452091385633995,24.299033631712025,null,null,null,null,null,null,null,null,null,125,119.06875340257152,37.392423916504356,37.861386226041688,548.48773292793601,530.36767760158511,0.83902458976788985,27.897490636907769,29.462080322085519,0,0,0,16.985888946397427,15.18952941708458,0.12151623533667665,null,null,null,443.69547475367222,425.19651602447794,3.4015721281958236,460.68136370006965,440.38604544156254,3.5230883635325005,0,0,0,460.68136370006965,440.38604544156254,3.5230883635325005]
[20090521,"Example 1",126,122.677048,118.10498918323211,0,2.8155304201956928,60.23891387772715,0,9.3393813959263938E-2,22.105192993082198,0,121.05235610945991,112.14701210447799,2.0835569810512107,7.0100654052229183,44.145225826063161,40.565407579353867,6.8442319799418602E-2,22.522791765636541,24.514095797698815,null,null,null,null,null,null,null,null,null,126,120.06875340257152,37.395505848749039,37.466779908180797,540.61483104176534,523.26849664084659,0.83816386624131745,27.954944140327825,29.677054042648571,0,0,0,17.059324752527079,15.285636634876642,0.12131457646727493,null,null,null,444.60705685982572,426.2106841334795,3.3826244772498373,461.66638161235278,441.49632076835616,3.5039390537171125,0,0,0,461.66638161235278,441.49632076835616,3.5039390537171125]
[20090521,"Example 1",127,123.677048,119.10498918323211,0,2.7720729602579706,60.10649533271868,0,9.4440145410763149E-2,22.186933024754556,0,122.05235610945991,113.14701210447799,2.0865165101368506,6.9353802107573141,43.438942171200431,40.015121254494005,6.8251858512615518E-2,22.592501296972234,24.730127288096817,null,null,null,null,null,null,null,null,null,127,121.06875340257152,37.397925612607168,37.075679723077577,532.90524849712619,516.29517104845866,0.83730799607662121,28.011549433945667,29.891920411171501,0,0,0,17.131283117121765,15.379317229891191,0.12109698606213536,null,null,null,445.49795485764116,427.19741311989173,3.3637591584243443,462.62923797476293,442.57673034978291,3.4848561444864794,0,0,0,462.62923797476293,442.57673034978291,3.4848561444864794]
[20090521,"Example 1",128,124.677048,120.10498918323211,0,2.7287331727016668,59.971865234348478,0,9.5485754192268013E-2,22.267966619742559,0,123.05235610945991,114.14701210447799,2.0893659789030998,6.8606245808632869,42.744827782180465,39.470022132427331,6.8057281571133263E-2,22.661238690251501,24.947126710351732,null,null,null,null,null,null,null,null,null,128,122.06875340257152,37.399709983371757,36.688092968183831,525.35464329601086,509.44537500782928,0.83645696423659865,28.067324028414987,30.106681558307407,0,0,0,17.201799157068219,15.470637246270885,0.12086435348649129,null,null,null,446.36870856863925,428.15761826822506,3.3449813927205083,463.57050772570744,443.62825551449595,3.4658457462069996,0,0,0,463.57050772570744,443.62825551449595,3.4658457462069996]
[20090521,"Example 1",129,125.677048,121.10498918323211,0,2.685535580485618,59.835021849285511,0,9.6530432652011888E-2,22.348303496317222,0,124.05235610945991,115.14701210447799,2.0921092401860477,6.7858273977831782,42.062725861798434,38.93026391633844,6.7858805770802208E-2,22.729022231518453,25.16509251463372,null,null,null,null,null,null,null,null,null,129,123.06875340257152,37.400884655946371,36.304025209705443,517.95881156684061,502.71680223480354,0.83561076157718583,28.122284979458055,30.321339551924886,0,0,0,17.270907301144401,15.559661480280578,0.1206175308548882,null,null,null,447.21984165846027,429.09217675575212,3.3262959438430397,464.49074895960467,444.65183823603269,3.446913474697928,0,0,0,464.49074895960467,444.65183823603269,3.446913474697928]
[20090521,"Example 1",130,126.677048,122.10498918323211,0,2.6425040729641807,59.695964250725865,0,9.7573973534941003E-2,22.427953189611436,0,125.05235610945991,116.14701210447799,2.0947500255236871,6.7110172461946886,41.392477145104877,38.395984870284906,6.7656641788025121E-2,22.79586979282448,25.384023004665284,null,null,null,null,null,null,null,null,null,130,124.06875340257152,37.401474286143568,35.9234803400863,510.71368255220017,496.10716847957258,0.83476938467703377,28.176448901843102,30.535896397093769,0,0,0,17.338641288369072,15.646453440270697,0.12035733415592845,null,null,null,448.05186209763599,430.00192947913382,3.3077071498394908,465.39050338600504,445.64838291940453,3.4280644839954193,0,0,0,465.39050338600504,445.64838291940453,3.4280644839954193]
[20090521,"Example 1",131,127.677048,123.10498918323211,0,2.5996618656017376,59.554692325064693,0,9.8616170094516481E-2,22.506925055988585,0,126.05235610945991,117.14701210447799,2.0972919481654015,6.6362223760559989,40.733920263454955,37.867308627073143,6.7450994245615584E-2,22.861798842548154,25.603916347883114,null,null,null,null,null,null,null,null,null,131,125.06875340257152,37.401502530536952,35.54646063487013,503.615313795823,489.61421372185976,0.83393283565986798,28.229831982876334,30.750354036185044,0,0,0,17.405034167709328,15.731075314571543,0.12008454438604231,null,null,null,448.86526261307898,430.88768278310096,3.2892189525427553,466.27029678078833,446.61875809767253,3.4093034969287981,0,0,0,466.27029678078833,446.61875809767253,3.4093034969287981]
[20090521,"Example 1",132,128.67704800000001,124.10498918323212,0,2.5570314632661701,59.411206777974456,0,9.9656816203712445E-2,22.585228277285232,0,127.05235610945991,118.14701210447799,2.0997385060599716,6.5614706669493152,40.086892087365705,37.344344969689651,6.7242061785718538E-2,22.92682645546525,25.824770584971883,null,null,null,null,null,null,null,null,null,132,126.06875340257152,37.400992084910548,35.172966808884361,496.65988652052306,483.23570408679939,0.83310112201056907,28.282449995427093,30.964714349077155,0,0,0,17.470118299036685,15.813587946575907,0.11979990868618112,null,null,null,449.66052113015832,431.7502100968531,3.2708349249761599,467.13063942919501,447.56379804342902,3.3906348336623409,0,0,0,467.13063942919501,447.56379804342902,3.3906348336623409]
[20090521,"Example 1",133,129.67704800000001,125.10498918323212,0,2.514634627149543,59.26550913987581,0,0.10069570646510576,22.662871864933049,0,128.05235610945991,119.14701210447799,2.1020930848178563,6.4867895939950628,39.451228048924769,36.827190585973661,6.7030037149037131E-2,22.990969322572731,26.046583638805743,null,null,null,null,null,null,null,null,null,133,127.06875340257152,37.399964721348226,34.802998071694461,489.84370118910766,476.96943350666021,0.83227425638585717,28.334318310503459,31.178979153461263,0,0,0,17.533925355228668,15.894050816320719,0.11950414147609563,null,null,null,450.43810120525347,432.5902534835086,3.2525582968684859,467.97202656048216,448.48430429982932,3.3720624383445812,0,0,0,467.97202656048216,448.48430429982932,3.3720624383445812]
[20090521,"Example 1",134,130.67704800000001,126.10498918323212,0,2.4724923453390701,59.117601770787815,0,0.10173263631995437,22.739864663963196,0,129.05235610945991,120.14701210447799,2.1043589606439235,6.4122061953999694,38.826762444500112,36.315929796366461,6.6815107259635242E-2,23.054243760670222,26.269353322832202,null,null,null,null,null,null,null,null,null,134,128.06875340257153,37.398441324004935,34.436552182281815,483.16317324063675,470.81322515148247,0.83145225642041043,28.385451909395247,31.393150205238136,0,0,0,17.596486325318534,15.97252202792861,0.1191979255815568,null,null,null,451.19845244871868,433.40852510763756,3.2343919784152058,468.79493877403723,449.38104713556618,3.3535899039967627,0,0,0,468.79493877403723,449.38104713556618,3.3535899039967627]
[20090521,"Example 1",135,131.67704800000001,127.10498918323212,0,2.430624807037113,58.967487864546698,0,0.1027674021561646,22.816215356897601,0,130.05235610945991,121.14701210447799,2.1065393032371982,6.3377470416942021,38.213328718506759,35.81063525471005,6.6597453314635749E-2,23.116665721703761,26.493077348930989,null,null,null,null,null,null,null,null,null,135,129.06875340257153,37.396441923600527,34.073625502902416,476.61482899471577,464.76493264978939,0.83063514452919973,28.435865395400725,31.607229198999487,0,0,0,17.657831518602372,16.049058302319054,0.11888191335051151,null,null,null,451.94201093821431,434.2057086256147,3.2163385824119608,469.5998424568167,450.25476692793376,3.3352204957624725,0,0,0,469.5998424568167,450.25476692793376,3.3352204957624725]
[20090521,"Example 1",136,132.67704800000001,128.10498918323214,0,2.3890513804055176,58.815171452380447,0,0.10379980141505266,22.891932467530573,0,131.05235610945991,122.14701210447799,2.1086371786545679,6.263438206704242,37.610759728987325,35.311368622187906,6.6377250878185384E-2,23.178250801875464,26.717753334778621,null,null,null,null,null,null,null,null,null,136,130.06875340257153,37.393985730676064,33.714213052087743,470.19530171678394,458.82244111873496,0.82982294770676202,28.485573005152403,31.821217768587879,0,0,0,17.71799056961741,16.123714974643104,0.1185567277547287,null,null,null,452.66919962238563,434.98246050324519,3.1984004448768029,470.38719019200306,451.10617547788831,3.3169571726315317,0,0,0,470.38719019200306,451.10617547788831,3.3169571726315317]
[20090521,"Example 1",137,133.67704800000001,129.10498918323214,0,2.3477905939883823,58.660657405830051,0,0.10482963269680166,22.967024364604192,0,132.05235610945991,123.14701210447799,2.1106555521357229,6.1893052402995581,37.018887995756771,34.818181214605062,6.6154669979091266E-2,23.239014250523873,26.943378810748779,null,null,null,null,null,null,null,null,null,137,131.06875340257153,37.391091167651545,33.358308556753023,463.90132783770082,452.98366802148092,0.82901569732410718,28.534588619557134,32.035117487728023,0,0,0,17.776992443911524,16.19654599593931,0.11822296347400957,null,null,null,453.38042871490012,435.73941126485897,3.1805796442690437,471.15742115881164,451.93595726079826,3.298802607743053,0,0,0,471.15742115881164,451.93595726079826,3.298802607743053]
[20090521,"Example 1",138,134.67704800000001,130.10498918323214,0,2.306860121646511,58.503951439007444,0,0.10585669586452519,23.041499265381553,0,133.05235610945991,124.14701210447799,2.1125972908869257,6.1153731429430795,36.437545931859049,34.331114623300493,6.5929875211586358E-2,23.29897097877922,27.169951226376071,null,null,null,null,null,null,null,null,null,138,132.06875340257153,37.387775899722968,33.005904503382027,457.72974332117718,447.24656386806288,0.82821342892388838,28.5829257743647,32.248929870723877,0,0,0,17.834865444528209,16.267603938547847,0.11788118796049164,null,null,null,454.0760960788644,436.47716667780594,3.1628780194043911,471.91096152339259,452.74477061635378,3.2807592073648824,0,0,0,471.91096152339259,452.74477061635378,3.2807592073648824]
[20090521,"Example 1",139,135.67704800000001,131.10498918323214,0,2.2662767709189167,58.345060110181429,0,0.10688079214684584,23.11536523912029,0,134.05235610945991,125.14701210447799,2.1144651668215015,6.0416663420672503,35.866566059071438,33.850201310064278,6.5703025838716705E-2,23.358135567998303,27.397467956409908,null,null,null,null,null,null,null,null,null,139,133.06875340257153,37.384056864635831,32.656992188260702,451.67748017288466,441.60911277465101,0.82741618201443745,28.630597670378872,32.462656373215758,0,0,0,17.891637219136641,16.336940004857951,0.11753194248099245,null,null,null,454.75658760167306,437.19630887605894,3.1452971861586976,472.64822482080967,453.53324888091686,3.2628291286396895,0,0,0,472.64822482080967,453.53324888091686,3.2628291286396895]
[20090521,"Example 1",140,136.67704800000001,132.10498918323214,0,2.2260564747093161,58.183990822683789,0,0.10790172423890163,23.188630210450473,0,135.05235610945991,126.14701210447799,2.1162618592552156,5.9682086702895152,35.305781208182118,33.375465176503269,6.5474275897882503E-2,23.416522277983383,27.625926306483567,null,null,null,null,null,null,null,null,null,140,134.06875340257153,37.379950301371196,32.311561766736062,445.7415630853418,436.06933289485823,0.82662399986321589,28.677617183324021,32.676298392991747,0,0,0,17.947334767740546,16.404604038998578,0.11717574313570413,null,null,null,455.42227756034805,437.89739742639421,3.1278385530456729,473.36961232808858,454.30200146539278,3.245014296181377,0,0,0,473.36961232808858,454.30200146539278,3.245014296181377]
[20090521,"Example 1",141,137.67704800000001,133.10498918323214,0,2.1862142861809128,58.020751825129572,0,0.10891929640169533,23.261301962659278,0,136.05235610945991,127.14701210447799,2.1179899575549501,5.8950233454733088,34.755024704751818,32.906922108358273,6.5243774308101243E-2,23.474145054989922,27.85532351842232,null,null,null,null,null,null,null,null,null,141,135.06875340257153,37.375471777779495,31.969602301479473,439.91910621292038,430.62527673558156,0.82583692929020336,28.723996873380337,32.889857270848353,0,0,0,18.00198445090415,16.47064454111538,0.11681308185188213,null,null,null,456.07352897745153,438.58097034041884,3.1105033357476515,474.07551342835569,455.05161488153425,3.2273164175995337,0,0,0,474.07551342835569,455.05161488153425,3.2273164175995337]
[20090521,"Example 1",142,138.67704800000001,134.10498918323214,0,2.1467643767293128,57.855352210944908,0,0.10993331455970511,23.33338814088588,0,137.05235610945991,128.14701210447799,2.1196519637393383,5.8221329526334324,34.214130541055916,32.44458049532733,6.5011664978597547E-2,23.531017539527372,28.085656775213081,null,null,null,null,null,null,null,null,null,142,136.06875340257153,37.370636217196406,31.631101809736268,434.20731007155678,425.27503136880546,0.82505502046169743,28.76974899439962,33.103334291495365,0,0,0,18.055611998437335,16.535108683907385,0.11644442735146046,null,null,null,456.710693967662,439.24754503550474,3.0932925706725687,474.76630596609931,455.78265371941211,3.2097369980240291,0,0,0,474.76630596609931,455.78265371941211,3.2097369980240291]
[20090521,"Example 1",143,139.67704800000001,135.10498918323214,0,2.1077200368920774,57.68780191719798,0,0.11094358639667538,23.404896255229016,0,138.05235610945991,129.14701210447799,2.1212502950302214,5.7495594276773021,33.682933534885521,31.9884417269915,6.4778086918354127E-2,23.587153073958174,28.316923205656806,null,null,null,null,null,null,null,null,null,143,137.06875340257153,37.365457924074242,31.296047309547742,428.60345855798772,420.01671854981856,0.82427832668497059,28.814885502813645,33.316730684500335,0,0,0,18.108242518486232,16.598042331125473,0.11607022609178652,null,null,null,457.33411407512119,439.89761924751156,3.0762071276049761,475.44235659360743,456.49566157863705,3.1922773536967628,0,0,0,475.44235659360743,456.49566157863705,3.1922773536967628]
[20090521,"Example 1",144,140.67704800000001,136.10498918323214,0,2.0690936800437756,57.518111722729508,0,0.11194992144951135,23.475833683770546,0,139.05235610945991,130.14701210447799,2.122787286353998,5.6773240429670082,33.161269475868259,31.53850066547415,6.4543174346290227E-2,23.642564709899066,28.549119888723869,null,null,null,null,null,null,null,null,null,144,138.06875340257153,37.359950608661343,30.964424864933221,423.10491608355602,414.84849475140857,0.82350690420419836,28.859418066246313,33.530047625267756,0,0,0,18.159900506978929,16.659490057761133,0.11569090317889676,null,null,null,457.94412060166786,440.53167189799819,3.0592477215138763,476.1040211086468,457.1911619557593,3.1749386246927731,0,0,0,476.1040211086468,457.1911619557593,3.1749386246927731]
[20090521,"Example 1",145,141.67704800000001,137.10498918323214,0,2.0308968487175481,57.346293245579908,0,0.11295213120020398,23.546207675516982,0,140.05235610945991,131.14701210447799,2.1242651927921208,5.6054473946807306,32.648975259950959,31.094746095493125,6.4307056801765253E-2,23.697265215429567,28.782243857631006,null,null,null,null,null,null,null,null,null,145,139.06875340257153,37.354127410761166,30.63621963002258,417.70912481782722,409.76855112275524,0.82274081199803073,28.903358071840387,33.743286236049457,0,0,0,18.210609857379357,16.719495171678247,0.11530686325295343,null,null,null,458.54103492607942,441.15016391845649,3.0424149235755618,476.7516447834588,457.86965909013475,3.1577217868285157,0,0,0,476.7516447834588,457.86965909013475,3.1577217868285157]
[20090521,"Example 1",146,142.67704800000001,138.10498918323214,0,1.9931402233881392,57.172358939711252,0,0.11395002916571026,23.616025353262128,0,141.05235610945991,132.14701210447799,2.1256861919801646,5.5339493919458729,32.1458890126654,30.65716115248572,6.4069859255127065E-2,23.751267082112125,29.01629210365811,null,null,null,null,null,null,null,null,null,146,140.06875340257153,37.348000922601855,30.311415892133081,412.41360203749178,404.7751133810205,0.82198011157916262,28.94671663430961,33.956447586981362,0,0,0,18.260393870706146,16.778099736463968,0.11491849134564362,null,null,null,459.12516881446595,441.75353903395728,3.0257091714654609,477.38556268517209,458.53163877042124,3.1406276628111045,0,0,0,477.38556268517209,458.53163877042124,3.1406276628111045]
[20090521,"Example 1",147,143.67704800000001,139.10498918323214,0,1.955833633546707,56.996322091024005,0,0.11494343098572474,23.685293716373117,0,142.05235610945991,133.14701210447799,2.1270523864550475,5.4628492477108415,31.651850201778863,30.225723729502739,6.3831702218056272E-2,23.804582531828366,29.251261579721209,null,null,null,null,null,null,null,null,null,147,141.06875340257153,37.341583210846288,29.989997113785563,407.21593757618643,399.86644164290368,0.82122486679621898,28.98950460372571,34.169532697143637,0,0,0,18.309275265775565,16.835344595294885,0.11452615370948901,null,null,null,459.69682472194484,442.34222450843566,3.0091307789689501,478.0060999877204,459.17756910373055,3.1236569326784389,0,0,0,478.0060999877204,459.17756910373055,3.1236569326784389]
[20090521,"Example 1",148,144.67704800000001,140.10498918323214,0,1.9189860708950619,56.818196812668262,0,0.1159321545082718,23.754019643502069,0,143.05235610945991,134.14701210447799,2.1283658059501258,5.3921654713172158,31.166699739909561,29.800406863578004,6.3592701853475583E-2,23.857223523436001,29.487149203718005,null,null,null,null,null,null,null,null,null,148,142.06875340257153,37.334885837771708,29.67194597365776,402.11379137109282,395.04083020282991,0.82047514363825258,29.031732573050469,34.382542535639985,0,0,0,18.357276189631381,16.891269395634879,0.11413019861915459,null,null,null,460.25629608575707,442.9166318537259,2.9926799449576076,478.61357227538844,459.80790124936078,3.1068101435767619,0,0,0,478.61357227538844,459.80790124936078,3.1068101435767619]
[20090521,"Example 1",149,145.67704800000001,141.10498918323214,0,1.8826057044852802,56.637998039651748,0,0.11691601987305739,23.822209895225935,0,144.05235610945991,135.14701210447799,2.1296284096380247,5.3219158627292273,30.690280077667552,29.381179102287557,6.3352970084822186E-2,23.909201759250671,29.723951861659931,null,null,null,null,null,null,null,null,null,149,143.06875340257153,37.327919881647254,29.357244406474543,397.1048911023222,390.29660726383077,0.81973101004212046,29.073410885421751,34.595478022693136,0,0,0,18.404418228126492,16.945912614598189,0.11373095714495429,null,null,null,460.80386760996868,443.47715750431325,2.9763567617739146,479.20828583809515,460.42307011891143,3.0900877189188685,0,0,0,479.20828583809515,460.42307011891143,3.0900877189188685]
[20090521,"Example 1",150,146.67704800000001,142.10498918323214,0,1.8466998976308575,56.455741522746742,0,0.11789484959252228,23.889871116616565,0,145.05235610945991,136.14701210447799,2.1308420883211747,5.2521175083731277,30.222435287857479,28.968004851211827,6.3112614704495362E-2,23.960528691357286,29.961666410605876,null,null,null,null,null,null,null,null,null,150,144.06875340257153,37.320695956336884,29.045873641836632,392.18702992127294,385.63213462664532,0.81899253570298236,29.114549641202562,34.808340030753641,0,0,0,18.450722416624448,16.999311584828373,0.11332874389885582,null,null,null,461.33981554192019,444.02418345966095,2.9601612230644063,479.79053795854463,461.02349504448932,3.0734899669632623,0,0,0,479.79053795854463,461.02349504448932,3.0734899669632623]
[20090521,"Example 1",151,147.67704800000001,143.10498918323214,0,1.8112752264165022,56.27144382169984,0,0.11886846863053371,23.957009839743396,0,146.05235610945991,137.14701210447799,2.1320086665701452,5.182786778535351,29.763011141262151,28.560844703016556,6.2871739481314651E-2,24.011215527754874,30.200289681409565,null,null,null,null,null,null,null,null,null,151,145.06875340257153,37.313224230154475,28.73781424199138,387.3580642643397,381.04580734210765,0.81825979188815157,29.155158704801792,35.021129385617876,0,0,0,18.496209250790759,17.051502520758202,0.11292385775336558,null,null,null,461.864407940587,444.5580778958581,2.9440932310983983,480.36061719137774,461.60958041661632,3.0570170888517638,0,0,0,480.36061719137774,461.60958041661632,3.0570170888517638]
[20090521,"Example 1",152,148.67704800000001,144.10498918323214,0,1.7763374996363321,56.085122297749464,0,0.11983670447866955,24.023632486110298,0,147.05235610945991,138.14701210447799,2.1331299048099592,5.1139393262645916,29.311855174501481,28.159655748860619,6.2630444266843388E-2,24.061273238339432,30.439818481293724,null,null,null,null,null,null,null,null,null,152,146.06875340257153,37.305514443996955,28.433046138550527,382.61591174845029,376.5360533313758,0.81753285125448705,29.1952477112746,35.23384686755427,0,0,0,18.540898697446856,17.102520545130183,0.1125165825337512,null,null,null,462.3779049370101,445.07919574822034,2.9281526036067129,480.91880363445694,462.18171629335052,3.0406691861404638,0,0,0,480.91880363445694,462.18171629335052,3.0406691861404638]
[20090521,"Example 1",153,149.67704800000001,145.10498918323214,0,1.7418917799933329,55.896795105456981,0,0.12079938723003644,24.08974536902938,0,148.05235610945991,139.14701210447799,2.1342075013546689,5.0455900877203748,28.868816750443038,27.76439187283404,6.2388825100444377E-2,24.110712560728633,30.680249596261959,null,null,null,null,null,null,null,null,null,153,147.06875340257153,37.297575928780702,28.131548668161461,377.95854914512859,372.10133297821966,0.81681178766951912,29.234826072710618,35.446493212433424,0,0,0,18.584810205461014,17.152399715669354,0.11210718768411343,null,null,null,462.88055898697064,445.58787926639405,2.9123390801725102,481.46536919243164,462.74027898206339,3.0244462678566233,0,0,0,481.46536919243164,462.74027898206339,3.0244462678566233]
[20090521,"Example 1",154,150.67704800000001,146.10498918323214,0,1.7079424063975517,55.706481183858138,0,0.12175634965057919,24.155354695932932,0,149.05235610945991,140.14701210447799,2.1352430943905478,4.9777532839075223,28.433747111618057,27.37500403011866,6.2146974312954489E-2,24.159544005932776,30.921579793359506,null,null,null,null,null,null,null,null,null,154,148.06875340257153,37.289417622205661,27.833300607140551,373.38401042986851,367.74013869714304,0.8160966760364663,29.273902984417436,35.659069112860792,0,0,0,18.627962716653283,17.201173051812308,0.11169592890787212,null,null,null,463.37261511607375,446.0844585434084,2.8966523282039507,482.000577832727,463.28563159522071,3.0083482571118227,0,0,0,482.000577832727,463.28563159522071,3.0083482571118227]
[20090521,"Example 1",155,151.67704800000001,147.10498918323214,0,1.6744930172054848,55.51420024694351,0,0.12270742724783607,24.220466570625682,0,150.05235610945991,141.14701210447799,2.1362382639083397,4.9104424237343451,28.006499427076903,26.991440509552444,6.1904980628876366E-2,24.207777863875819,31.163805822793105,null,null,null,null,null,null,null,null,null,155,149.06875340257153,37.281048084870839,27.538280205077001,368.89038490376743,363.45099448080401,0.8153875921232876,29.312487430906781,35.871575219309491,0,0,0,18.670374676692969,17.248872561406891,0.11128304878327026,null,null,null,463.85431115741437,446.5692520200439,2.8810919485164121,482.52468583410734,463.81812458145077,2.9923749972996823,0,0,0,482.52468583410734,463.81812458145077,2.9923749972996823]
[20090521,"Example 1",156,152.67704800000001,148.10498918323214,0,1.641546574248989,55.319972773476273,0,0.12365245833709704,24.285086995479418,0,151.05235610945991,142.14701210447799,2.1371945335850611,4.8436703083302213,27.586928833099972,26.613647181267247,6.166292926700221E-2,24.255424208770204,31.406924419918759,null,null,null,null,null,null,null,null,null,156,150.06875340257153,37.272475515764206,27.246465217418617,364.47581538449953,359.23245542986939,0.81468461239590073,29.350588191690203,36.084012141250824,0,0,0,18.71206404596883,17.295529267306186,0.11086877735452684,null,null,null,464.32587798199228,447.04256696579819,2.8656574805499884,483.03794202796109,464.33809623310435,2.9765262579045149,0,0,0,483.03794202796109,464.33809623310435,2.9765262579045149]
[20090521,"Example 1",157,153.67704800000001,149.10498918323214,0,1.6091053875084294,55.12381999615851,0,0.12459128410493076,24.349221873571132,0,152.05235610945991,143.14701210447799,2.13811337261592,4.7774490365569449,27.17489246815698,26.241567730051749,6.1420902039391267E-2,24.302492904349879,31.650932307107183,null,null,null,null,null,null,null,null,null,157,151.06875340257153,37.263707767149285,26.957832937050636,360.13849646382459,355.08310726814699,0.81398781385567798,29.388213846891318,36.296380448280956,0,0,0,18.753048310414577,17.341173233790485,0.11045333269930245,null,null,null,464.78753972205374,447.50469993766455,2.8503484072462713,483.54058803246829,464.84587317145503,2.9608017399455733,0,0,0,483.54058803246829,464.84587317145503,2.9608017399455733]
[20090521,"Example 1",158,154.67704800000001,150.10498918323214,0,1.5771711402918582,54.925763890156063,0,0.12552374867004054,24.412877010766959,0,153.05235610945991,144.14701210447799,2.1389961974969691,4.7117900116474676,26.770249502492721,25.875143875079115,6.1178977448639836E-2,24.348993608964612,31.895826195494386,null,null,null,null,null,null,null,null,null,158,152.06875340257153,37.254752358870043,26.672360224880379,355.87667282896263,351.00156584558039,0.81329727388131956,29.425372782680871,36.508680671241564,0,0,0,18.793344492272958,17.385833592757798,0.11003692147315063,null,null,null,465.23951398752661,447.95593721786111,2.8351641596067156,484.03285847979959,465.34177081061893,2.9452010810798668,0,0,0,484.03285847979959,465.34177081061893,2.9452010810798668]
[20090521,"Example 1",159,155.67704800000001,151.10498918323214,0,1.5457449147890472,54.725827160995152,0,0.12644969914142598,24.476058117753027,0,154.05235610945991,145.14701210447799,2.1398443737591504,4.6467039489044399,26.372861162695774,25.514315576619428,6.093723078339007E-2,24.394935780539853,32.141602786625654,null,null,null,null,null,null,null,null,null,159,153.06875340257153,37.245616492094989,26.390023539441351,351.68863764525253,346.98647663142407,0.81261307007518402,29.462073196540985,36.720913303333468,0,0,0,18.832969160783779,17.429538569631656,0.10961973943164564,null,null,null,465.6820120757211,448.39655523158279,2.8201041209533511,484.51498123650487,465.82609380121443,2.9297238603849962,0,0,0,484.51498123650487,465.82609380121443,2.9297238603849962]
[20090521,"Example 1",160,156.67704800000001,152.10498918323214,0,1.5148272178769537,54.524033231843582,0,0.1273689856738153,24.538770812015237,0,155.05235610945991,146.14701210447799,2.1406592176544419,4.5822008843913871,25.98259075159077,25.159021230340873,6.0695734212031831E-2,24.440328681405322,32.388258773999908,null,null,null,null,null,null,null,null,null,160,154.06875340257153,37.236307062520787,26.110798965530766,347.57273099766394,343.03651419973039,0.81193528011415284,29.498323102364584,36.93307880122088,0,0,0,18.87193844278238,17.472315508941357,0.10920197193088348,null,null,null,466.11523917446834,448.82682094579508,2.8051676309112192,484.98717761725072,466.29913645473641,2.9143696028421027,0,0,0,484.98717761725072,466.29913645473641,2.9143696028421027]
[20090521,"Example 1",161,157.67704800000001,153.10498918323214,0,1.4844180070609243,54.320406230190557,0,0.12828146152034844,24.60102061976907,0,156.05235610945991,147.14701210447799,2.1414419977948458,4.5182901845488281,25.599303663776983,24.809197849785388,6.0454556874564851E-2,24.485181382996103,32.635790844521068,null,null,null,null,null,null,null,null,null,161,155.06875340257153,37.226830673055034,25.83466224189646,343.52733838879675,339.15038170903927,0.81126398160508673,29.534130335395616,37.145177586125499,0,0,0,18.910268033196449,17.514190899535954,0.10878379440705561,null,null,null,466.53939455885978,449.24699225001683,2.7903539891305393,485.44966259205626,466.76118314955278,2.8991377835375949,0,0,0,485.44966259205626,466.76118314955278,2.8991377835375949]
[20090521,"Example 1",162,158.67704800000001,154.10498918323214,0,1.4545167164438004,54.114970973940494,0,0.12918698308249144,24.662812977841305,0,157.05235610945991,148.14701210447799,2.1421939367449925,4.454980556668021,25.222867397118716,24.464781237584994,6.0213764972592149E-2,24.529502770429669,32.884195679863012,null,null,null,null,null,null,null,null,null,162,156.06875340257153,37.217193645997199,25.561588787987557,339.55088929112162,335.32681037798989,0.81059925194491644,29.569502557015987,37.357210044909195,0,0,0,18.947973205430262,17.555190399398828,0.10836537283579524,null,null,null,466.95467178176517,449.65731832000591,2.7756624587654688,485.90264498719546,467.21250871940475,2.884027831601264,0,0,0,485.90264498719546,467.21250871940475,2.884027831601264]
[20090521,"Example 1",163,159.67704800000001,155.10498918323214,0,1.4251222826230119,53.90775295693701,0,0.13008540995716003,24.724153235504566,0,158.05235610945991,149.14701210447799,2.1429162125691605,4.3922800601559988,24.853151560478093,24.125706145967591,5.9973421857424838E-2,24.57330154696189,33.133469957753604,null,null,null,null,null,null,null,null,null,163,157.06875340257153,37.207402034736106,25.291553729786813,335.64185575131916,331.56455895841106,0.80994116818541517,29.604447259384141,37.569176531143448,0,0,0,18.985068821626299,17.595338860034474,0.10794686417199063,null,null,null,467.3612588582846,450.05803996518608,2.7610922697250682,486.34632767991093,467.65337882522056,2.8690391338970587,0,0,0,486.34632767991093,467.65337882522056,2.8690391338970587]
[20090521,"Example 1",164,160.67704800000001,156.10498918323214,0,1.3962331704236892,53.698778333933198,0,0.13097660498104416,24.785046656266534,0,159.05235610945991,150.14701210447799,2.143609960333543,4.3301961185258069,24.490027877964117,23.791906427080697,5.9733588116285201E-2,24.616586238325816,33.383610353183542,null,null,null,null,null,null,null,null,null,164,158.06875340257153,37.197461634981856,25.024531924740046,331.79875104464372,327.86241320726828,0.80928980690267061,29.638971769930656,37.78107736616537,0,0,0,19.021569342795974,17.634660350404197,0.10752841677075729,null,null,null,467.7593384443029,450.44938996062609,2.7466426217111346,486.7809077870989,468.0840503110303,2.8541710384818919,0,0,0,486.7809077870989,468.0840503110303,2.8541710384818919]
[20090521,"Example 1",165,161.67704800000001,157.10498918323214,0,1.367847398383607,53.488073905027214,0,0.13186043427212116,24.845498419614973,0,160.05235610945991,151.14701210447799,2.1442762735645986,4.268735532047498,24.13337018995793,23.463315173643558,5.9494321656600631E-2,24.659365196956045,33.634613539544802,null,null,null,null,null,null,null,null,null,165,159.06875340257153,37.187377995549326,24.760497985800647,328.02012837734242,324.2191853587176,0.80864524407127825,29.673083255715845,37.992912840118869,0,0,0,19.057488838811242,17.673178180390753,0.10711017079024698,null,null,null,468.14908800931306,450.83159336433255,2.7323126870565608,487.20657684812431,468.50477154472333,2.8394228578468081,0,0,0,487.20657684812431,468.50477154472333,2.8394228578468081]
[20090521,"Example 1",166,162.67704800000001,158.10498918323214,0,1.3399625639134087,53.275667099580637,0,0.13273676726835004,24.905513622719649,0,161.05235610945991,152.14701210447799,2.1449162056643565,4.2079044909963157,23.783054451159362,23.139864850418395,5.9255677788385433E-2,24.701646606101828,33.886476189703572,null,null,null,null,null,null,null,null,null,166,160.06875340257153,37.177156428709957,24.499426304607063,324.30457963524395,320.63371359738738,0.80800755494326448,29.706788727653905,38.2046832129801,0,0,0,19.09284099825047,17.710914923776201,0.10669225857696507,null,null,null,468.53068000365801,451.20486782056599,2.7181016133769034,487.6235210019085,468.91578274434221,2.8247938719538688,0,0,0,487.6235210019085,468.91578274434221,2.8247938719538688]
[20090521,"Example 1",167,163.67704800000001,159.10498918323214,0,1.3125758680631721,53.06158595963938,0,0.13360547676354487,24.965097282092604,0,162.05235610945991,153.14701210447799,2.1455307712835427,4.1477085894362684,23.438958725885996,22.821487416972655,5.9017709304713201E-2,24.743438483832151,34.139194977012039,null,null,null,null,null,null,null,null,null,167,161.06875340257153,37.16680202012796,24.241291073810071,320.65073417670152,317.10486153387626,0.80737681393174199,29.740095044608442,38.416388715566583,0,0,0,19.127639138092579,17.747892440720346,0.10627480503425357,null,null,null,468.90428202035912,451.5694238498678,2.7040085260471125,488.03192115845172,469.31731629058817,2.8102833310813664,0,0,0,488.03192115845172,469.31731629058817,2.8102833310813664]
[20090521,"Example 1",168,164.67704800000001,160.10498918323214,0,1.2856841398334449,52.845859122877499,0,0.13446643894042815,25.024254335208173,0,163.05235610945991,154.14701210447799,2.1461209476534187,4.0881528394787283,23.100963180843653,22.508114442186326,5.8780466560288007E-2,24.784748686935622,34.392766576262886,null,null,null,null,null,null,null,null,null,168,162.06875340257153,37.156319638396482,23.98606630856926,317.05725766815556,313.63151768335524,0.8067530944992839,29.773008917363565,38.628029550529412,0,0,0,19.161896213254231,17.784131899730092,0.10585792797458388,null,null,null,469.27005695167719,451.92546512643321,2.6900325305144834,488.43195316493143,469.70959702616329,2.7958904584890671,0,0,0,488.43195316493143,469.70959702616329,2.7958904584890671]
[20090521,"Example 1",169,165.67704800000001,161.10498918323214,0,1.2592838599760938,52.62851580508412,0,0.13531953340086517,25.08298964208322,0,164.05235610945991,155.14701210447799,2.1466876758772209,4.0292416859577207,22.76895007557329,22.199677210938308,5.8543997548122506E-2,24.825584914718075,34.647187664590732,null,null,null,null,null,null,null,null,null,169,163.06875340257153,37.145713944188834,23.733725867236672,313.52285096066299,310.21259494806668,0.80613646905101233,29.805536912474974,38.83960589332753,0,0,0,19.195624825965613,17.819653799112693,0.10544173845628813,null,null,null,469.62816314056477,452.27318874344195,2.6761727144582363,488.8237879665304,470.09284254255465,2.7816144529145244,0,0,0,488.8237879665304,470.09284254255465,2.7816144529145244]
[20090521,"Example 1",170,166.67704800000001,162.10498918323214,0,1.2333711842368691,52.409585782215224,0,0.13616464319328939,25.141307986819484,0,165.05235610945991,156.14701210447799,2.1472318621821005,3.9709790214652596,22.442803750769013,21.896106823389836,5.8308347974340959E-2,24.865954712700642,34.902454922323308,null,null,null,null,null,null,null,null,null,170,164.06875340257153,37.134989399039277,23.484243471245716,310.04624900579142,306.84703010440603,0.80552700883236972,29.837685456004987,39.051117893184148,0,0,0,19.228837234980986,17.85447798790825,0.10502634110534265,null,null,null,469.97875452715527,452.61278546691915,2.6624281498054065,489.20759176213625,470.46726345482739,2.7674544909107492,0,0,0,489.20759176213625,470.46726345482739,2.7674544909107492]
[20090521,"Example 1",171,167.67704800000001,163.10498918323214,0,1.2079419659980311,52.189099372032665,0,0.13700165483732685,25.199214079108689,0,166.05235610945991,157.14701210447799,2.1477543791324609,3.9133682016924349,22.122410614648516,21.597334287263049,5.8073561331120661E-2,24.905865476221209,35.15856503378641,null,null,null,null,null,null,null,null,null,171,165.06875340257153,37.124150273767498,23.23759272422474,306.62621980936427,303.53378329520802,0.80492478383155253,29.869460837145489,39.262565674024351,0,0,0,19.261545364620968,17.888623686299024,0.10461183442280131,null,null,null,470.3219807904361,452.94443997867148,2.6487978946121138,489.58352615505709,470.8330636649705,2.7534097290349151,0,0,0,489.58352615505709,470.8330636649705,2.7534097290349151]
[20090521,"Example 1",172,168.67704800000001,164.10498918323214,0,1.1829917782855193,51.967087415351912,0,0.13783045834563534,25.25671255570149,0,167.05235610945991,158.14701210447799,2.1482560668055966,3.8564120610237356,21.807659127548185,21.303290603497327,5.7839678967795918E-2,24.945324453941687,35.41551468806491,null,null,null,null,null,null,null,null,null,172,166.06875340257153,37.113200656560245,22.993747130353228,303.26156342158447,300.27183752776438,0.8043298626865687,29.900869211732633,39.473949335394096,0,0,0,19.293760813643921,17.922109505494802,0.10419831107845816,null,null,null,470.65798748525094,453.26833110881478,2.6352809948186904,489.95174829889487,471.19044061430958,2.7394793058971487,0,0,0,489.95174829889487,471.19044061430958,2.7394793058971487]
[20090521,"Example 1",173,169.67704800000001,165.10498918323214,0,1.1585159351108754,51.743581256923108,0,0.13865094724297036,25.313807981841347,0,168.05235610945991,159.14701210447799,2.1487377339305289,3.8001129283347157,21.498439784903098,21.013906845647629,5.7606740160142188E-2,24.98433875126393,35.673300579723197,null,null,null,null,null,null,null,null,null,173,167.06875340257153,37.102144460723366,22.752680111980574,299.95111096215692,297.0601981780589,0.80374231259688755,29.931916605656824,39.685268953359177,0,0,0,19.325494863944467,17.954953467095493,0.10378585819130343,null,null,null,470.98691617477022,453.58463205838092,2.6218764858865948,490.31241103871469,471.53958552547641,2.7256623440778984,0,0,0,490.31241103871469,471.53958552547641,2.7256623440778984]
[20090521,"Example 1",174,170.67704800000001,166.10498918323214,0,1.1345095121233857,51.5186127259676,0,0.13946301858250487,25.370504852664379,0,169.05235610945991,160.14701210447799,2.1492001589909382,3.7444726429449982,21.194645098763335,20.729114233373597,5.7374782177869885E-2,25.02291533365673,35.931919409487357,null,null,null,null,null,null,null,null,null,174,168.06875340257153,37.090985432116774,22.514365026524267,296.69372367904117,293.89789250159976,0.80316219923962529,29.962608918171657,39.89652458138557,0,0,0,19.356758489077624,17.987173021933273,0.10337455759731766,null,null,null,471.30890455856911,453.89351061246975,2.6085833943245387,490.66566304764672,471.880683634403,2.7119579519218564,0,0,0,490.66566304764672,471.880683634403,2.7119579519218564]
[20090521,"Example 1",175,171.67704800000001,167.10498918323214,0,1.1109673665532092,51.292214116394966,0,0.14026657295941902,25.426807594565982,0,170.05235610945991,161.14701210447799,2.1496440912930805,3.6894925706812223,20.896169577988331,20.448844200351971,5.7143840350350937E-2,25.061061029896184,36.19136788489137,null,null,null,null,null,null,null,null,null,175,169.06875340257153,37.07972715628464,22.278775182668241,293.48829203957445,290.78396915122306,0.80258958669023006,29.992951925105018,40.107716251199392,0,0,0,19.387562362607461,18.018785068398202,0.10296448610513258,null,null,null,471.62408659644581,454.19512934438109,2.5954007391107492,491.01164895905328,472.21391441277927,2.6983652252158814,0,0,0,491.01164895905328,472.21391441277927,2.6983652252158814]
[20090521,"Example 1",176,172.67704800000001,168.10498918323214,0,1.0878841564307125,51.064418166724337,0,0.14106151452178972,25.482720566535225,0,171.05235610945991,162.14701210447799,2.150070251999574,3.6351736200067988,20.602909707251563,20.173028456928886,5.6913948130607274E-2,25.09878253522216,36.451642720889851,null,null,null,null,null,null,null,null,null,176,170.06875340257153,37.068373065292562,22.045883855878401,290.33373485271437,287.71749770214575,0.80202453734760293,30.02295128197575,40.318843973627338,0,0,0,19.417916866279711,18.049805970252105,0.10255571574006878,null,null,null,471.93259262811364,454.48964581114922,2.5823275330178932,491.35050949439335,472.53945178140134,2.6848832487579624,0,0,0,491.35050949439335,472.53945178140134,2.6848832487579624]
[20090521,"Example 1",177,173.67704800000001,169.10498918323214,0,1.065254359071778,50.835258039734754,0,0.14184775097880681,25.538248061457907,0,172.05235610945991,163.14701210447799,2.1504793351299361,3.5815162581776083,20.314763924980202,19.901599047814511,5.6685137157589903E-2,25.136086414412915,36.712740640439044,null,null,null,null,null,null,null,null,null,177,171.06875340257153,37.056926444283107,21.815664303254756,287.2289984212336,284.69756818453186,0.80146711186360331,30.052612527018862,40.529907739416849,0,0,0,19.447832098018111,18.080251573936774,0.10214831397704392,null,null,null,472.23454948889355,454.77721274086969,2.5693627838467212,491.68238158691167,472.85746431480646,2.6715110978237653,0,0,0,491.68238158691167,472.85746431480646,2.6715110978237653]
[20090521,"Example 1",178,174.67704800000001,170.10498918323214,0,1.0430722888226389,50.604767301869764,0,0.14262519360634834,25.593394307389097,0,173.05235610945991,164.14701210447799,2.1508720085287347,3.5285205273852154,20.031632600345201,19.634488405106769,5.6457437316778485E-2,25.172979104780328,36.97465837504852,null,null,null,null,null,null,null,null,null,178,172.06875340257153,37.045390437760659,21.588089777738116,284.17305572272244,281.7232906237677,0.80091736907687316,30.081941084122516,40.74090752003648,0,0,0,19.477317879744568,18.110137225383131,0.10174234396282658,null,null,null,472.53008062153469,455.05797821220011,2.5565054955741577,492.00739850127928,473.16811543758325,2.6582478395369846,0,0,0,492.00739850127928,473.16811543758325,2.6582478395369846]
[20090521,"Example 1",179,175.67704800000001,171.10498918323214,0,1.0213321140617229,50.372979902420866,0,0.14339375724995007,25.64816346879617,0,174.05235610945991,165.14701210447799,2.1512489148022178,3.4761860608516928,19.753418009411458,19.371629396918824,5.6230876799135104E-2,25.209466919087646,37.237392665304384,null,null,null,null,null,null,null,null,null,179,173.06875340257153,37.0337680556162,21.363133541689425,281.16490561831796,278.79379458862104,0.80037536595091474,30.110942265679487,40.951843268456258,0,0,0,19.506383765023461,18.13947778632869,0.10133786472809324,null,null,null,472.81930618428419,455.3320858263865,2.5437546694211535,492.32568994930767,473.47156361271522,2.6450925341492471,0,0,0,492.32568994930767,473.47156361271522,2.6450925341492471]
[20090521,"Example 1",180,176.67704800000001,172.10498918323214,0,1.0000278734591286,50.139930152515802,0,0.14415336032520309,25.702559647772667,0,175.05235610945991,166.14701210447799,2.1516106722242676,3.4245120988421021,19.480024310547908,19.112955371868992,5.6005482158439493E-2,25.245556048392277,37.500940261366836,null,null,null,null,null,null,null,null,null,180,174.06875340257153,37.022062178902175,21.140768879860296,278.20357208812146,275.908228747419,0.79984115751635754,30.139621275356021,41.162714919907827,0,0,0,19.535039046531136,18.168287650151822,0.10093493138973234,null,null,null,473.10234315532443,455.59967487215692,2.5311093048453164,492.63738220185559,473.76796252230872,2.6320442362350485,0,0,0,492.63738220185559,473.76796252230872,2.6320442362350485]
[20090521,"Example 1",181,177.67704800000001,173.10498918323214,0,0.97915349149744846,49.905652703936539,0,0.14490392481562292,25.756586885224561,0,176.05235610945991,167.14701210447799,2.1519578756125171,3.3734975045633719,19.211357519193285,18.858400199681352,5.5781278367042587E-2,25.281252564815496,37.765297923442482,null,null,null,null,null,null,null,null,null,181,175.06875340257153,37.010275565367294,20.920969111771914,275.28810349229883,273.06576043234355,0.79931479681733442,30.167983210780854,41.373522392624693,0,0,0,19.563292763351381,18.196580757231118,0.10053359534381832,null,null,null,473.37930543369799,455.86088048380492,2.5185684004630104,492.94259819704939,474.05746124103604,2.6191019958068291,0,0,0,492.94259819704939,474.05746124103604,2.6191019958068291]
[20090521,"Example 1",182,178.67704800000001,174.10498918323214,0,0.95870279326042995,49.670182527792583,0,0.14564537626803115,25.810249162028818,0,177.05235610945991,168.14701210447799,2.152291097175453,3.3231407799203572,18.947325482064869,18.607898308131112,5.5558288870069764E-2,25.316562424240988,38.03046242223337,null,null,null,null,null,null,null,null,null,182,176.06875340257153,36.998410854760778,20.703707603520122,272.41757185690443,270.2655752119154,0.79879633486189916,30.196033066156755,41.584265588563092,0,0,0,19.591153708098069,18.224370609838985,0.10013390444966476,null,null,null,473.65030393682758,456.11583379276544,2.5061309549053048,493.24145764492567,474.3402044026044,2.6062648593549693,0,0,0,493.24145764492567,474.3402044026044,2.6062648593549693]
[20090521,"Example 1",183,179.67704800000001,175.10498918323214,0,0.93866951849836677,49.433554893075346,0,0.14637764378548776,25.863550400165622,0,178.05235610945991,169.14701210447799,2.1526108873313201,3.2734400811021835,18.687837850892318,18.361384716557598,5.5336535638104742E-2,25.351491468944424,38.296430539363882,null,null,null,null,null,null,null,null,null,183,177.06875340257153,36.986470573915085,20.488957779024471,269.59107218352364,267.50687647172981,0.79828582057640751,30.223775734797446,41.79494439410206,0,0,0,19.61863043386677,18.25167028657906,9.9735903205350057E-2,null,null,null,473.91544669474706,456.36466207297963,2.4937959676119106,493.53407712861383,474.61633235955867,2.5935318708172606,0,0,0,493.53407712861383,474.61633235955867,2.5935318708172606]
[20090521,"Example 1",184,180.67704800000001,176.10498918323214,0,0.91904733498123647,49.195805345118892,0,0.14710066001783403,25.916494463824698,0,179.05235610945991,170.14701210447799,2.1529177754996236,3.224393233973962,18.432806055752341,18.118795066155709,5.5116039218390901E-2,25.386045430155846,38.56319906778706,null,null,null,null,null,null,null,null,null,184,178.06875340257153,36.974457141616064,20.276693130737357,266.80772178182514,264.7888850034434,0.79778330076377502,30.251216011591954,42.005558680725343,0,0,0,19.645731261016643,18.278492456377009,9.9339632915092443E-2,null,null,null,474.17483894114605,456.60748888031935,2.4815624395669529,493.82057020216268,474.88598133669637,2.5809020724820457,0,0,0,493.82057020216268,474.88598133669637,2.5809020724820457]
[20090521,"Example 1",185,181.67704800000001,177.10498918323214,0,0.89982985115258962,48.956969683992035,0,0.14781436114987934,25.969085160486394,0,180.05235610945991,171.14701210447799,2.1532122708660144,3.1759977492515326,18.182143278075891,17.880065647247037,5.4896818784581497E-2,25.420229930556722,38.830764812170401,null,null,null,null,null,null,null,null,null,185,179.06875340257153,36.962372873268841,20.066887229831075,264.06665962420419,262.11083860204297,0.79728882006553914,30.278358595399176,42.216108305682795,0,0,0,19.672464283784791,18.304849392034768,9.894513184883659E-2,null,null,null,474.4285832013382,456.84443418634271,2.4694293739802307,494.10104748512299,475.14928357837749,2.5683745058290675,0,0,0,494.10104748512299,475.14928357837749,2.5683745058290675]
[20090521,"Example 1",186,182.67704800000001,178.10498918323214,0,0.88101062809878461,48.717083942847829,0,0.14851868688729231,26.021326241978478,0,181.05235610945991,172.14701210447799,2.1534948631213315,3.1282508374382241,17.935764423392229,17.645133423719212,5.4678892185070944E-2,25.454050486713502,39.099124589263553,null,null,null,null,null,null,null,null,null,186,180.06875340257153,36.950219985367745,19.859513735878853,261.36704572168838,259.47199167136745,0.79680242092763676,30.305208091374325,42.426593112632908,0,0,0,19.698837376734886,18.330752983358277,9.855243539439934E-2,null,null,null,474.67677937724642,457.07561450662143,2.4573957769173194,494.37561675398132,475.40636748997969,2.5559482123117188,0,0,0,494.37561675398132,475.40636748997969,2.5559482123117188]
[20090521,"Example 1",187,183.67704800000001,179.10498918323214,0,0.86258319084962976,48.476184366254664,0,0.14921358044024777,26.073221405508825,0,182.05235610945991,173.14701210447799,2.153766023175554,3.0811494235052925,17.693586093871524,17.413936054814009,5.4462275989943541E-2,25.487512511449463,39.368275228247711,null,null,null,null,null,null,null,null,null,187,181.06875340257153,36.938000599778036,19.654546406045871,258.7080605203243,256.87161483784985,0.79632414356980874,30.331769013230055,42.637012932266863,0,0,0,19.724858201042387,18.356214749869064,9.8161576202508372E-2,null,null,null,474.91952482951154,457.30114302388864,2.4454606578817573,494.64438303055391,475.65735777375772,2.5436222340842658,0,0,0,494.64438303055391,475.65735777375772,2.5436222340842658]
[20090521,"Example 1",188,184.67704800000001,180.10498918323214,0,0.84454103902768329,48.234307388534354,0,0.14989898850487945,26.124774294675191,0,183.05235610945991,174.14701210447799,2.1540262038474043,3.0346901612992379,17.455526560721992,17.186411914434089,5.4246985536569779E-2,25.52062131615639,39.638213571068007,null,null,null,null,null,null,null,null,null,188,182.06875340257153,36.92571674783705,19.451959103806715,256.08890431730805,254.30899457244587,0.7958540259585507,30.358045785433912,42.847367582913229,0,0,0,19.750534210618461,18.381245853109778,9.7772584325052009E-2,null,null,null,475.15691445681591,457.5211297062275,2.4336230303522739,494.90744866743438,475.90237555933726,2.5313956146773258,0,0,0,494.90744866743438,475.90237555933726,2.5313956146773258]
[20090521,"Example 1",189,185.67704800000001,181.10498918323214,0,0.82687765686448167,47.991489612131566,0,0.15057486124259853,26.175988500452107,0,184.05235610945991,175.14701210447799,2.1542758405303348,2.9888694476609285,17.22150573649304,16.962500108128804,5.4033034973883134E-2,25.553382113048041,39.908936472750007,null,null,null,null,null,null,null,null,null,189,183.06875340257153,36.91337037428201,19.251725807204753,253.50879669613198,251.78343282068118,0.79539210378351843,30.384042745344264,43.057656871124493,0,0,0,19.775872658075301,18.405857108554343,9.7385487346848376E-2,null,null,null,475.38904077251499,457.73568142052085,2.4218819122778883,495.16491343059027,476.14153852907521,2.5192673996247366,0,0,0,495.16491343059027,476.14153852907521,2.5192673996247366]
[20090521,"Example 1",190,186.67704800000001,182.10498918323214,0,0.80958652260287045,47.747767786038615,0,0.15124115225733401,26.226867562156016,0,185.05235610945991,176.14701210447799,2.1545153518356006,2.9436834362436106,16.991445147333067,16.742140487911957,5.3820437305371741E-2,25.585800017356608,40.180440801700449,null,null,null,null,null,null,null,null,null,190,184.06875340257153,36.900963341011568,19.053820616668567,250.96697598005764,249.29424664074801,0.79493841043729441,30.409764145286761,43.267880592245483,0,0,0,19.800880600535002,18.430058997132772,9.700031051122511E-2,null,null,null,475.61599397866945,457.94490204136684,2.4102363265335098,495.41687457920443,476.37496103849963,2.507236637044735,0,0,0,495.41687457920443,476.37496103849963,2.507236637044735]
[20090521,"Example 1",191,187.67704800000001,183.10498918323214,0,0.79266111730506961,47.503178784299934,0,0.15189781857075346,26.277414968388811,0,186.05235610945991,177.14701210447799,2.154745140213119,2.8991280510181276,16.765267905245452,16.525273665054666,5.360920443081417E-2,25.617880049474138,40.452723439993427,null,null,null,null,null,null,null,null,null,191,185.06875340257153,36.888497430687721,18.858217762400756,248.46269870325776,246.84076784957605,0.79449297699843247,30.435214154573075,43.478038530963694,0,0,0,19.825564905284946,18.453861676381134,9.6617076839691798E-2,null,null,null,475.83786203756227,458.14889255565646,2.3986853013385154,495.6634269428472,476.60275423203757,2.4953023781782071,0,0,0,495.6634269428472,476.60275423203757,2.4953023781782071]
[20090521,"Example 1",192,188.67704800000001,184.10498918323214,0,0.77609493308689104,47.257759584619102,0,0.1525448205955256,26.327634157960542,0,187.05235610945991,178.14701210447799,2.1549655925507976,2.8551989994556153,16.542898680383828,16.311841020989689,5.3399347186793768E-2,25.649627137040135,40.725781283642185,null,null,null,null,null,null,null,null,null,192,186.06875340257153,36.875974350184734,18.664891611353429,245.99523909898323,244.42234267678069,0.7940558322176805,30.460396861463838,43.688130461842256,0,0,0,19.849932255281988,18.477274991226881,9.6235807245973345E-2,null,null,null,476.05473074078958,458.34775116300381,2.3872278706406447,495.90466299607158,476.82502615423067,2.4834636778866179,0,0,0,495.90466299607158,476.82502615423067,2.4834636778866179]
[20090521,"Example 1",193,189.67704800000001,185.10498918323214,0,0.75988148079861872,47.011547247091997,0,0.15318212210668417,26.37752852079187,0,188.05235610945991,179.14701210447799,2.1551770807529902,2.811891785379085,16.324263673423268,16.101784716454919,5.3190875386019354E-2,25.681046116976969,40.999611242857824,null,null,null,null,null,null,null,null,null,193,187.06875340257153,36.863395733891146,18.47381667380531,243.56388860415026,242.03833142639786,0.79362700250729645,30.485316275077317,43.898156149835451,0,0,0,19.873989154508568,18.500308484419762,9.5856520644661977E-2,null,null,null,476.26668377600197,458.54157337220164,2.3758630744673659,496.14067293051056,477.04188185662139,2.4717195951120279,0,0,0,496.14067293051056,477.04188185662139,2.4717195951120279]
[20090521,"Example 1",194,190.67704800000001,186.10498918323214,0,0.74401429717349932,46.764578893088,0,0.15380969021115826,26.42710139879668,0,189.05235610945991,180.14701210447799,2.1553799622987344,2.7692017214771933,16.109290588042359,15.895047698997772,5.2983797855486445E-2,25.712141737474386,41.274210242294437,null,null,null,null,null,null,null,null,null,194,188.06875340257153,36.850763146871003,18.284967609553938,241.16795537975491,239.68810814629694,0.79320651193335523,30.509976327245909,44.108115350787436,0,0,0,19.897741933183074,18.522971406618169,9.5479234054732826E-2,null,null,null,476.47380279138349,458.73045209388044,2.3645899592468065,496.37154472456655,477.25342350049863,2.4600691933015395,0,0,0,496.37154472456655,477.25342350049863,2.4600691933015395]
[20090521,"Example 1",195,191.67704800000001,187.10498918323214,0,0.72848695146473863,46.516891684301953,0,0.15442749531552891,26.476356086745245,0,190.05235610945991,181.14701210447799,2.1555745807804034,2.7271239414743178,15.897908603546224,15.691573708953751,5.2778122473504704E-2,25.742918659924843,41.549575221282673,null,null,null,null,null,null,null,null,null,195,189.06875340257153,36.838078087890018,18.09831923373698,238.80676384655575,237.3710603051658,0.79279438221096643,30.534380874321677,44.318007811914065,0,0,0,19.921196752827797,18.545272726141288,9.5103962698160446E-2,null,null,null,476.67616745793845,458.91447772952529,2.3534075781001298,496.59736421076627,477.45975045566655,2.44851154079829,0,0,0,496.59736421076627,477.45975045566655,2.44851154079829]
[20090521,"Example 1",196,192.67704800000001,188.10498918323214,0,0.71329305159204048,46.268522801997641,0,0.1550355110920803,26.525295833108871,0,191.05235610945991,182.14701210447799,2.1557612664233887,2.6856534119528752,15.690048347660619,15.491307284008364,5.2573856205627288E-2,25.773381460810359,41.825703134050052,null,null,null,null,null,null,null,null,null,196,190.06875340257153,36.825341992312211,17.913846522295923,236.47965423547561,235.08658847694744,0.79239063270229237,30.558533698932774,44.527833272268843,0,0,0,19.944359611196688,18.567221138396217,9.4730720093858245E-2,null,null,null,476.87385552966691,459.09373825701374,2.3423149911072128,496.81821514086357,477.66095939540998,2.4370457112010713,0,0,0,496.81821514086357,477.66095939540998,2.4370457112010713]
[20090521,"Example 1",197,193.67704800000001,189.10498918323214,0,0.69842624981853318,46.019509426464083,0,0.15563371444320631,26.573923840886007,0,192.05235610945991,183.14701210447799,2.1559403365874177,2.6447849438245137,15.485641869520855,15.294193762441791,5.2371005139503241E-2,25.803534633543109,42.102590949931248,null,null,null,null,null,null,null,null,null,197,191.06875340257153,36.812556234872368,17.731524617095562,234.18598215220808,232.8341060326149,0.7919952804172905,30.582438511692068,44.737591463192508,0,0,0,19.967236347066514,18.588825074990449,9.4359518147159635E-2,null,null,null,477.06694290169543,459.2683193128143,2.3313112655472805,497.03417924876192,477.85714438780474,2.4256707836944402,0,0,0,497.03417924876192,477.85714438780474,2.4256707836944402]
[20090521,"Example 1",198,194.67704800000001,190.10498918323214,0,0.68388024797884728,45.769888716704628,0,0.15622208546424202,26.622243268410553,0,193.05235610945991,184.14701210447799,2.1561120962500953,2.604513203448299,15.284622612881213,15.100179285154166,5.2169574518688776E-2,25.833382590260069,42.380235653565954,null,null,null,null,null,null,null,null,null,198,192.06875340257153,36.799722132329499,17.551328830711149,231.92511815552299,230.61303883915855,0.79160834001706926,30.606098952859757,44.947282108747281,0,0,0,19.989832644893585,18.610092712538442,9.3990367235042643E-2,null,null,null,477.25550366644177,459.43830427099675,2.3203954761161452,497.24533631133534,478.04839698353521,2.4143858433511878,0,0,0,497.24533631133534,478.04839698353521,2.4143858433511878]
[20090521,"Example 1",199,195.67704800000001,191.10498918323214,0,0.66964880227876555,45.51969779037865,0,0.15680060740478169,26.67025723014282,0,194.05235610945991,185.14701210447799,2.1562768384732394,2.5648327233948396,15.086925389564563,14.909210796559858,5.1969568775440407E-2,25.862929663573759,42.658634245086795,null,null,null,null,null,null,null,null,null,199,193.06875340257153,36.786840946006109,17.373234650896737,229.69644734879068,228.42282496566034,0.79122982381977791,30.62951859396097,45.156904926135724,0,0,0,20.012154039339503,18.631031981172182,9.3623276287297399E-2,null,null,null,477.43961016787063,459.60377431917709,2.309566705121493,497.45176420721015,478.23480630034925,2.40318998140879,0,0,0,497.45176420721015,478.23480630034925,2.40318998140879]
[20090521,"Example 1",200,196.67704800000001,192.10498918323214,0,0.65572572768666093,45.268973704014947,0,0.15736926662855491,26.717968797443415,0,195.05235610945991,186.14701210447799,2.1564348448525692,2.5257379128563371,14.892486353171817,14.721236044436091,5.1770991562518083E-2,25.892180108279721,42.937783740296858,null,null,null,null,null,null,null,null,null,200,194.06875340257153,36.773913884218153,17.197217744745711,227.49936898426228,226.26291439632772,0.79085974180892693,30.652700939360113,45.366459626104756,0,0,0,20.034205919668519,18.65165057276451,9.3258252863822555E-2,null,null,null,477.61933305391807,459.76480853153902,2.2988240426576949,497.65353897358659,478.4164591043035,2.3920822955215173,0,0,0,497.65353897358659,478.4164591043035,2.3920822955215173]
[20090521,"Example 1",201,197.67704800000001,193.10498918323214,0,0.64210490193644987,45.017753433514137,0,0.1579280525719218,26.765380999330752,0,196.05235610945991,187.14701210447799,2.1565863859512882,2.4872230677034692,14.701242973068943,14.536203578806084,5.1573845784027406E-2,25.921138103022223,43.217681170836705,null,null,null,null,null,null,null,null,null,201,195.06875340257153,36.760942104600105,17.023253962556193,225.33329607965942,224.13276875035669,0.79049810164405077,30.675649427792976,45.575945913335161,0,0,0,20.055993534019464,18.67195594887421,9.2895303228229906E-2,null,null,null,477.79474132713733,459.92148393904171,2.2881665867614016,497.85073486115681,478.59343988791591,2.3810618899896312,0,0,0,497.85073486115681,478.59343988791591,2.3810618899896312]
[20090521,"Example 1",202,198.67704800000001,194.10498918323214,0,0.62878026916151886,44.766073854958925,0,0.15847695770105763,26.812496823222311,0,197.05235610945991,188.14701210447799,2.1567317217180904,2.4492823801907404,14.513134008665924,14.354062749930765,5.1378133625322391E-2,25.949807751919192,43.498323584342387,null,null,null,null,null,null,null,null,null,202,196.06875340257153,36.747926716329587,16.851319341412047,223.19765504664898,222.03186100849689,0.79014490867361997,30.69836743385812,45.7853634868166,0,0,0,20.077521993555195,18.691955348421693,9.2534432417929177E-2,null,null,null,477.96590239363661,460.07387559694286,2.2775934435492222,498.04342438719181,478.76583094536454,2.3701278759671514,0,0,0,498.04342438719181,478.76583094536454,2.3701278759671514]
[20090521,"Example 1",203,199.67704800000001,195.10498918323214,0,0.61574584317846559,44.513971725747915,0,0.159015977467894,26.859319215660115,0,198.05235610945991,189.14701210447799,2.156871101890105,2.4119099483128408,14.328099484002246,14.174763705480407,5.1183856581999108E-2,25.978193086147485,43.779708044593498,null,null,null,null,null,null,null,null,null,203,197.06875340257153,36.734868782255745,16.68139010849087,221.0918853307835,219.95967524617879,0.78980016595010694,30.720858269468682,45.994712040209258,0,0,0,20.098796276492351,18.711655795103638,9.2175644310855356E-2,null,null,null,478.13288211036365,460.2220566497428,2.2671037273386343,498.231678386856,478.93371244484644,2.3592793716494898,0,0,0,498.231678386856,478.93371244484644,2.3592793716494898]
[20090521,"Example 1",204,200.67704800000001,196.10498918323214,0,0.60299571043912614,44.261483666069623,0,0.15954511026488097,26.905851083021236,0,199.05235610945991,190.14701210447799,2.157004766381275,2.3750997848151005,14.14608066265035,13.998257386951789,5.09910154880008E-2,26.006298065489617,44.061831631652652,null,null,null,null,null,null,null,null,null,204,198.06875340257153,36.721769320935365,16.513442684109776,219.01543906251874,217.91570637307868,0.78946387424711828,30.743125185265722,46.203991262191643,0,0,0,20.119821232014356,18.731064104555148,9.181894168899582E-2,null,null,null,478.29574483079546,460.36609839365684,2.2566965607532197,498.41556606280983,479.09716249821201,2.3485155024422157,0,0,0,498.41556606280983,479.09716249821201,2.3485155024422157]
[20090521,"Example 1",205,201.67704800000001,197.10498918323214,0,0.59052403266880416,44.00864614073155,0,0.16006435737863658,26.952095292212746,0,200.05235610945991,191.14701210447799,2.1571329456566581,2.3388458258618314,13.967020022948097,13.82449552539345,5.0799610542860807E-2,26.03412657984283,44.344691441995757,null,null,null,null,null,null,null,null,null,205,199.06875340257153,36.708629308580619,16.347453684519639,216.96778071892584,215.89945987898801,0.78913603207850258,30.765171371994334,46.413200836795099,0,0,0,20.140601584070318,18.750186891267212,9.1464326298864446E-2,null,null,null,478.45455344908828,460.50607033672105,2.2463710748132732,498.59515503315862,479.25625722798827,2.3378354011121378,0,0,0,498.59515503315862,479.25625722798827,2.3378354011121378]
[20090521,"Example 1",206,202.67704800000001,198.10498918323214,0,0.57832504920801975,43.755495441358704,0,0.16057372294255379,26.998054671352719,0,201.05235610945991,192.14701210447799,2.1572558610931218,2.303141939366967,13.790861233569233,13.653430636497195,5.0609641338107268E-2,26.061682450691873,44.628284588634024,null,null,null,null,null,null,null,null,null,206,200.06875340257153,36.695449680922195,16.183399924457419,214.94838679572382,213.91045158584663,0.78881663571933891,30.786999961843719,46.622340443726095,0,0,0,20.161141935062929,18.769030575267802,9.1111798909066996E-2,null,null,null,478.60936944274488,460.64204025662701,2.2361264090127526,498.77051137780779,479.41107083189479,2.3272382079218192,0,0,0,498.77051137780779,479.41107083189479,2.3272382079218192]
[20090521,"Example 1",207,203.67704800000001,199.10498918323214,0,0.56639307907462766,43.502067668976181,0,0.16107321388842677,27.043732010436592,0,202.05235610945991,193.14701210447799,2.1573737253268881,2.2679819329918267,13.617549129439968,13.485016015110695,5.0421106882850515E-2,26.088969432545902,44.912608201227449,null,null,null,null,null,null,null,null,null,207,201.06875340257153,36.682231334991314,16.021258419466964,212.95674548929156,211.94820740582051,0.78850567922872272,30.808614029752153,46.831409758675441,0,0,0,20.181446769427804,18.78760138857395,9.0761359365091554E-2,null,null,null,478.76025291384872,460.7740742563833,2.2259617113834942,498.94169968327651,479.56167564495723,2.3167230707485857,0,0,0,498.94169968327651,479.56167564495723,2.3167230707485857]
[20090521,"Example 1",208,204.67704800000001,200.10498918323214,0,0.5547225227625171,43.248398716986898,0,0.16156283989716302,27.089130061989863,0,203.05235610945991,194.14701210447799,2.1574867425883748,2.233359561815341,13.447029688008275,13.31920572922238,5.023400562857739E-2,26.115991214341097,45.197659426190597,null,null,null,null,null,null,null,null,null,208,202.06875340257153,36.668975130824109,15.861006387997849,210.99235638830942,210.01226310528233,0.7882031544742597,30.830016594677964,47.040408453615754,0,0,0,20.201520457107307,18.805905381422594,9.0413006641454782E-2,null,null,null,478.90726262891394,460.90223681788586,2.2158761385475283,499.10878308602128,479.70814219930844,2.3062891451889831,0,0,0,499.10878308602128,479.70814219930844,2.3062891451889831]
[20090521,"Example 1",209,205.67704800000001,201.10498918323214,0,0.54330786379254059,42.9945242545583,0,0.16204261334864734,27.134251541707041,0,204.05235610945991,195.14701210447799,2.1575951090247654,2.1992685356825814,13.279250005872017,13.155954613467081,5.0048335493173973E-2,26.142751420809347,45.483435426789931,null,null,null,null,null,null,null,null,null,209,203.06875340257153,36.655681893091611,15.702621253291188,209.0547301747103,208.10216407457173,0.78790905115817877,30.851210620837513,47.249336197086933,0,0,0,20.221367256921269,18.823948428287256,9.0066738891326589E-2,null,null,null,479.0504560574027,461.02659085348893,2.2058688557583204,499.27182331432397,479.85053928177621,2.2959355946496469,0,0,0,499.27182331432397,479.85053928177621,2.2959355946496469]
[20090521,"Example 1",210,206.67704800000001,202.10498918323214,0,0.53214367003071317,42.740479710428318,0,0.16251254927082232,27.179099129077731,0,205.05235610945991,196.14701210447799,2.1576990130107241,2.1657025262375256,13.114158275769778,12.995218262196754,4.9864093884196617E-2,26.16925361381432,45.769933383234509,null,null,null,null,null,null,null,null,null,210,204.06875340257153,36.642352412658553,15.546080645061657,207.1433883336191,206.21746510339989,0.78762335684498108,30.872199018911168,47.458192654470551,0,0,0,20.240991319837583,18.84173623368789,8.9722553493751855E-2,null,null,null,479.18988940895611,461.14719775565817,2.1959390369317058,499.43088072879368,479.98893398934604,2.2856615904254571,0,0,0,499.43088072879368,479.98893398934604,2.2856615904254571]
[20090521,"Example 1",211,207.67704800000001,203.10498918323214,0,0.52122459478820526,42.486300257140549,0,0.16297266528804505,27.22367546799947,0,206.05235610945991,197.14701210447799,2.1577986354476648,2.1326551736467692,12.95170376393928,12.83695302215955,4.968127772141416E-2,26.19550129365555,46.057150492758147,null,null,null,null,null,null,null,null,null,211,205.06875340257153,36.628987448073929,15.3913624009845,205.25786287198713,204.35773016177882,0.78734605699054072,30.892984647218213,47.666977488252506,0,0,0,20.26039669214509,18.859274337800667,8.9380447098581353E-2,null,null,null,479.32561766938261,461.26411744478003,2.1860858646672039,499.5860143615277,480.12339178258071,2.2754663117657854,0,0,0,499.5860143615277,480.12339178258071,2.2754663117657854]
[20090521,"Example 1",212,208.67704800000001,204.10498918323214,0,0.51054537771695041,42.232020795719805,0,0.16342298156879045,27.267983167378222,0,207.05235610945991,198.14701210447799,2.1578941500519671,2.1001200930206192,12.791836787845169,12.68111598482564,4.9499883458640127E-2,26.221497900341443,46.345083969695217,null,null,null,null,null,null,null,null,null,212,206.06875340257153,36.61558772699631,15.238444567995813,203.39769604561582,202.5225321863374,0.78707713497256948,30.913570312861559,47.87569035827574,0,0,0,20.279587318531341,18.87656812187435,8.9040415669218637E-2,null,null,null,479.45769463544832,461.37740841520582,2.1763085302604046,499.73728195397968,480.25397653708018,2.2653489459296234,0,0,0,499.73728195397968,480.25397653708018,2.2653489459296234]
[20090521,"Example 1",213,209.67704800000001,205.10498918323214,0,0.5001008455142143,41.977675940794875,0,0.16386352077275354,27.312024801716547,0,208.05235610945991,199.14701210447799,2.1579857236325228,2.0680908805387062,12.634508694278834,12.52766497839723,4.9319907104873634E-2,26.247246814832103,46.633731045549212,null,null,null,null,null,null,null,null,null,213,207.06875340257153,36.602153947556623,15.087305403414476,201.5624400943052,200.71145287191359,0.78681657212237299,30.933958772843226,48.084330921981611,0,0,0,20.298567045068015,18.893622813459956,8.8702454523286178E-2,null,null,null,479.58617294851388,461.48712777960225,2.1666062337070526,499.88473999358189,480.3807505930622,2.2553086882303388,0,0,0,499.88473999358189,480.3807505930622,2.2553086882303388]
[20090521,"Example 1",214,210.67704800000001,206.10498918323214,0,0.4898859124488098,41.723300006177908,0,0.16429430799742079,27.355802911689707,0,209.05235610945991,200.14701210447799,2.1580735163579798,2.036561119287196,12.479671837831578,12.376558559537274,4.9141344244770881E-2,26.272751360252663,46.923088969054298,null,null,null,null,null,null,null,null,null,214,208.06875340257153,36.58868677966111,14.937923375893169,199.75165698484142,198.92408246828529,0.78656434775780837,30.954152735151318,48.292898834641875,0,0,0,20.31733962210615,18.910443491459787,8.8366558371307413E-2,null,null,null,479.7111041270536,461.5933313116733,2.1569781836994077,500.02844374915975,480.50377480313307,2.2453447420707153,0,0,0,500.02844374915975,480.50377480313307,2.2453447420707153]
[20090521,"Example 1",215,211.67704800000001,207.10498918323214,0,0.47989558072115074,41.468926990906354,0,0.16471537072416592,27.399320004710219,0,210.05235610945991,201.14701210447799,2.1581576820140485,2.0055243848149038,12.327279559741557,12.22775600484885,4.8964190058462961E-2,26.298014803078004,47.21315500623048,null,null,null,null,null,null,null,null,null,215,209.06875340257153,36.575186866237004,14.790277166206891,197.96491816157248,197.16001958192871,0.78632043921737105,30.97415485981951,48.50139374958043,0,0,0,20.335908707084041,18.927035091002235,8.8032721353498766E-2,null,null,null,479.83253859810219,461.69607348732472,2.1474235976154636,500.16844730518625,480.62310857832694,2.2354563189689625,0,0,0,500.16844730518625,480.62310857832694,2.2354563189689625]
[20090521,"Example 1",216,212.67704800000001,208.10498918323214,0,0.4701249406686866,41.214590565755032,0,0.16512673876392781,27.442578555480928,0,211.05235610945991,202.14701210447799,2.1582383682512107,1.9749742504157763,12.177286167114758,12.081217302135387,4.8788439340739419E-2,26.323040354289486,47.503926440432139,null,null,null,null,null,null,null,null,null,216,210.06875340257153,36.561654824423385,14.644345667885766,196.20180430431924,195.41887098268219,0.7860848218953328,30.99396775995961,48.709815318385438,0,0,0,20.354277867249817,18.943402408147943,8.7700937074758997E-2,null,null,null,479.95052572766195,461.79540752432825,2.1379417015015196,500.30480359491179,480.73880993247622,2.2256426385762786,0,0,0,500.30480359491179,480.73880993247622,2.2256426385762786]
[20090521,"Example 1",217,213.67704800000001,209.10498918323214,0,0.46056917082781651,40.960324060222433,0,0.16552844420253426,27.485581006536876,0,212.05235610945991,203.14701210447799,2.1583157168231764,1.9449042921452289,12.029646912519187,11.936903141469594,4.8614086519614984E-2,26.347831170504591,47.795400572390605,null,null,null,null,null,null,null,null,null,217,211.06875340257153,36.548091246709582,14.500107987699222,194.46190509337396,193.70025141519255,0.78585746927785083,31.013594002768127,48.91816319111274,0,0,0,20.372450582301408,18.959550104433468,8.7371198637942252E-2,null,null,null,480.06511385011072,461.89138542054974,2.1285317300486164,500.4375644324121,480.85093552498319,2.2159029286865586,0,0,0,500.4375644324121,480.85093552498319,2.2159029286865586]
[20090521,"Example 1",218,214.67704800000001,210.10498918323214,0,0.45122353786273134,40.706160449997128,0,0.16592052134572316,27.52832976877642,0,213.05235610945991,204.14701210447799,2.1583898638164078,1.9153080935780606,11.884317973951806,11.794774906097702,4.8441125674297564E-2,26.37239035508,48.087574720249918,null,null,null,null,null,null,null,null,null,218,212.06875340257153,36.534496702023347,14.357543445999106,192.74481898136136,192.00378341503594,0.78563835297997919,31.033036110507666,49.126437016479905,0,0,0,20.390430246946011,18.975482711257698,8.7043498675494019E-2,null,null,null,480.1763502966445,461.98405799079677,2.1191929265632878,500.56678054359054,480.95954070205448,2.2062364252387821,0,0,0,500.56678054359054,480.95954070205448,2.2062364252387821]
[20090521,"Example 1",219,215.67704800000001,211.10498918323214,0,0.44208339637122973,40.452132344907398,0,0.16630300666391795,27.570827221981634,0,214.05235610945991,205.14701210447799,2.158460939871031,1.8861792503154042,11.741256435175645,11.654794663202335,4.8269550552570623E-2,26.39672095918899,48.380446219597737,null,null,null,null,null,null,null,null,null,219,213.06875340257153,36.520871736770992,14.216631576927707,191.05015297173378,190.32909712939659,0.7854274427835114,31.052296561463557,49.334636442051654,0,0,0,20.40822017338143,18.991204634116631,8.6717829379527989E-2,null,null,null,480.28428142278727,462.07347490234025,2.1099245429330606,500.69250159616871,481.06467953645688,2.1966423723125885,0,0,0,500.69250159616871,481.06467953645688,2.1966423723125885]
[20090521,"Example 1",220,216.67704800000001,212.10498918323214,0,0.4331441885769467,40.198271977357628,0,0.16667593873681308,27.613075715328364,0,215.05235610945991,206.14701210447799,2.1585290703934374,1.8575113742486029,11.600420266426434,11.516925154547938,4.8099354587611588E-2,26.420825982873687,48.674012423489181,null,null,null,null,null,null,null,null,null,220,214.06875340257153,36.507216875831581,14.077352128497484,189.3775224036828,188.67583014219028,0.78522470667557531,31.071377790876781,49.542761114417061,0,0,0,20.425823593701494,19.006720156691689,8.6394182530416766E-2,null,null,null,480.38895263500518,462.15968470916596,2.1007258395871178,500.81477622870671,481.16640486585766,2.1871200221175346,0,0,0,500.81477622870671,481.16640486585766,2.1871200221175346]
[20090521,"Example 1",221,217.67704800000001,213.10498918323214,0,0.42440144391698054,39.944611191253806,0,0.16703935819782337,27.655077567886114,0,216.05235610945991,207.14701210447799,2.1585943757608734,1.8292980975875031,11.461768305485121,11.38112978702851,4.7930530914257537E-2,26.444708376072818,48.968270702466157,null,null,null,null,null,null,null,null,null,221,215.06875340257153,36.4935326235071,13.939685062548529,187.72655074325709,187.04362730352221,0.78503011088791907,31.090282191853685,49.750810679359034,0,0,0,20.443243662227644,19.022033444796531,8.6072549523966202E-2,null,null,null,480.49040841645257,462.2427348850016,2.0915960854524958,500.93365207868021,481.26476832979813,2.1776686349764622,0,0,0,500.93365207868021,481.26476832979813,2.1776686349764622]
[20090521,"Example 1",222,218.67704800000001,214.10498918323214,0,0.41585077853346414,39.691181431419615,0,0.16739330767844501,27.696835069108204,0,217.05235610945991,208.14701210447799,2.158656971518305,1.8015330766608979,11.325260239114428,11.247372623138101,4.7763072384734907E-2,26.46837103962579,49.263218444570498,null,null,null,null,null,null,null,null,null,222,216.06875340257153,36.479819464430577,13.803610554590026,186.09686938049424,185.43214056338013,0.78484361993682006,31.109012116253162,49.95878478201513,0,0,0,20.460483457769076,19.037148550187514,8.5752921397241055E-2,null,null,null,480.58869235188337,462.32267185517418,2.08253455790619,501.04917580965247,481.35982040536169,2.168287479303431,0,0,0,501.04917580965247,481.35982040536169,2.168287479303431]
[20090521,"Example 1",223,219.67704800000001,215.10498918323214,0,0.40748789467707858,39.438013733504178,0,0.16773783175258097,27.738350479312029,0,218.05235610945991,209.14701210447799,2.1587169685678318,1.7742099954966715,11.190856584855892,11.115618371381595,4.759697158386867E-2,26.491816826253373,49.558853055352223,null,null,null,null,null,null,null,null,null,223,217.06875340257153,36.466077864433935,13.669108993531255,184.48811743236149,183.84102880944792,0.78466519666355039,31.127569875551881,50.166683067031478,0,0,0,20.477545985813119,19.052069414242212,8.5435288853104085E-2,null,null,null,480.68384715175478,462.39954102733486,2.0735405427234745,501.16139313756787,481.45161044157709,2.158975831576579,0,0,0,501.16139313756787,481.45161044157709,2.158975831576579]
[20090521,"Example 1",224,220.67704800000001,216.10498918323214,0,0.39930858003015285,39.185138714381779,0,0.16807297688088457,27.779626030149977,0,219.05235610945991,210.14701210447799,2.15877447335092,1.7473225691892948,11.05851867318446,10.985832376643081,4.7432220843786434E-2,26.51504854151597,49.855171957872038,null,null,null,null,null,null,null,null,null,224,218.06875340257153,36.452308271377355,13.536160981307535,182.89994155132078,182.26995770893799,0.78449480227532908,31.14595774168837,50.374505178709668,0,0,0,20.494434180648298,19.066799871510877,8.5119642283530708E-2,null,null,null,480.77591467555487,462.47338682110728,2.0646133340228006,501.27034885620316,481.54018669261814,2.1497329763063311,0,0,0,501.27034885620316,481.54018669261814,2.1497329763063311]
[20090521,"Example 1",225,221.67704800000001,217.10498918323214,0,0.39130870695651582,38.932586563042683,0,0.1683987913551574,27.82066392507118,0,220.05235610945991,211.14701210447799,2.1588295880237132,1.7208645470619131,10.928208630016361,10.85798061052666,4.7268812258127277E-2,26.538068944749753,50.152172592699685,null,null,null,null,null,null,null,null,null,225,219.06875340257153,36.438511115941793,13.404747332407172,181.33199573934672,180.7185995543515,0.78433239638671537,31.164177947886298,50.582250761145616,0,0,0,20.511150907421783,19.081343653145122,8.4805971791756099E-2,null,null,null,480.86493595437895,462.54425269669071,2.0557522342075143,501.37608686180073,481.6255963498358,2.14055820599927,0,0,0,501.37608686180073,481.6255963498358,2.14055820599927]
[20090521,"Example 1",226,222.67704800000001,218.10498918323214,0,0.38348423168485257,38.680387031974561,0,0.16871532524286034,27.861466339774253,0,221.05235610945991,212.14701210447799,2.1588824106256714,1.6948297156307046,10.799889359567304,10.732029661684937,4.7106737695775502E-2,26.560880749981383,50.449852417906371,null,null,null,null,null,null,null,null,null,226,220.06875340257153,36.424686812386291,13.274849073303645,179.78394116720935,179.18663311305369,0.78417793706136407,31.182232689457795,50.789919458362675,0,0,0,20.527698964133275,19.09570439020812,8.449426721331027E-2,null,null,null,480.95095121278274,462.61218118246677,2.0469565539047201,501.47865017691601,481.70788557267491,2.1314508211180305,0,0,0,501.47865017691601,481.70788557267491,2.1314508211180305]
[20090521,"Example 1",227,223.67704800000001,219.10498918323214,0,0.37583119343195032,38.428569429031803,0,0.16902263033177409,27.902035422651036,0,222.05235610945991,213.14701210447799,2.1589330352417804,1.6692119013785025,10.673524527555985,10.607946726147562,4.6945988814126642E-2,26.583486626821873,50.748208909053417,null,null,null,null,null,null,null,null,null,227,221.06875340257153,36.410835759271599,13.14644744179885,178.25544599886382,177.67374348057731,0.78403138085409929,31.200124124587074,50.997510914437726,0,0,0,20.544081083567253,19.10988561687056,8.4184518135993661E-2,null,null,null,481.03399988993675,462.67721390164473,2.0382256119015185,501.57808097350403,481.78709951851528,2.1224101300375122,0,0,0,501.57808097350403,481.78709951851528,2.1224101300375122]
[20090521,"Example 1",228,224.67704800000001,220.10498918323214,0,0.36834571347182538,38.177162609791367,0,0.16932076007485489,27.942373295222001,0,223.05235610945991,214.14701210447799,2.1589815521585631,1.644004973345043,10.549078544749454,10.485699597662823,4.6786557071902907E-2,26.605889201340002,51.04723955917553,null,null,null,null,null,null,null,null,null,228,222.06875340257153,36.396958340151564,13.019523886281613,176.74618522078171,176.17962193755773,0.78389268285324221,31.217854375095204,51.205024773621012,0,0,0,20.560299935165336,19.12389077349626,8.3876713918843243E-2,null,null,null,481.11412066010723,462.73939159798283,2.0295587350788722,501.67442059527258,481.8632823714791,2.1134354489977154,0,0,0,501.67442059527258,481.8632823714791,2.1134354489977154]
[20090521,"Example 1",229,225.67704800000001,221.10498918323214,0,0.36102399415634678,37.926194970391364,0,0.16960976953532894,27.982482052563071,0,224.05235610945991,215.14701210447799,2.1590280480141248,1.6192028455407763,10.426516550845344,10.365256658063002,4.6628433741528141E-2,26.628091056915927,51.346941878760212,null,null,null,null,null,null,null,null,null,229,223.06875340257153,36.383054924233733,12.89406006490645,175.25584047606739,174.70396581020543,0.78376179672314294,31.23542552718629,51.41246068044989,0,0,0,20.57635812684056,19.137723209621299,8.3570843710136677E-2,null,null,null,481.19135145248714,462.79875416062418,2.0209552583433372,501.76770957932769,481.93647737024548,2.1045261020534736,0,0,0,501.76770957932769,481.93647737024548,2.1045261020534736]
[20090521,"Example 1",230,226.67704800000001,222.10498918323214,0,0.35386231789265826,37.675694440849185,0,0.16988971533206226,28.022363763724364,0,225.05235610945991,216.14701210447799,2.1590726059424434,1.594799479191227,10.305804398686837,10.246586867664298,4.6471609921076712E-2,26.650094735075545,51.647313395722236,null,null,null,null,null,null,null,null,null,230,224.06875340257153,36.36912586701051,12.770037844696802,173.78409990320836,173.24647833422799,0.78363867474686111,31.252839632175839,51.619818279856879,0,0,0,20.592258206735512,19.151386186830624,8.3266896464480974E-2,null,null,null,481.2657294704016,462.8553406480795,2.0124145245568674,501.85798767713709,482.00672683491013,2.0956814210213484,0,0,0,501.85798767713709,482.00672683491013,2.0956814210213484]
[20090521,"Example 1",231,227.67704800000001,223.10498918323214,0,0.34685704608233558,37.425688478854624,0,0.17016065558524754,28.062020472140645,0,226.05235610945991,217.14701210447799,2.1591153057121213,1.570788884818586,10.186908638805255,10.129659755710376,4.6316076545806086E-2,26.671902736305778,51.948351655374601,null,null,null,null,null,null,null,null,null,231,225.06875340257153,36.355171510862121,12.647439300577082,172.33065797931525,171.80686852211215,0.78352326786894644,31.270098707201509,51.827097217271898,0,0,0,20.608002664925689,19.164882881535373,8.2964860959027595E-2,null,null,null,481.33729120990523,462.90918931138845,2.0039358844648851,501.9452938748309,482.07407219292384,2.0869007454239128,0,0,0,501.9452938748309,482.07407219292384,2.0869007454239128]
[20090521,"Example 1",232,228.67704800000001,224.10498918323214,0,0.34000461802692616,37.176204064033683,0,0.17042264986244279,28.101454196034322,0,227.05235610945991,218.14701210447799,2.1591562238598003,1.5471651241672795,10.069796504285993,10.014445410868783,4.6161824399286989E-2,26.693517520851742,52.250054220394638,null,null,null,null,null,null,null,null,null,232,226.06875340257153,36.341192185632671,12.526246714337852,170.89521536771099,170.38485103368257,0.78341552573827011,31.287204735916944,52.034297138719033,0,0,0,20.623593935070133,19.178216387654825,8.2664725808857004E-2,null,null,null,481.40607247779894,462.96033761649431,1.9955186966228202,502.02966641286906,482.13855400414911,2.0781834224316773,0,0,0,502.02966641286906,482.13855400414911,2.0781834224316773]
[20090521,"Example 1",233,229.67704800000001,225.10498918323214,0,0.33330154980420029,36.927267692677894,0,0.17067575912500305,28.140666928810333,0,228.05235610945991,219.14701210447799,2.1591954338184349,1.5239223119799024,9.954435895952372,9.9009144717876456,4.6008844124141156E-2,26.714941509495851,52.552418670786814,null,null,null,null,null,null,null,null,null,233,227.06875340257153,36.32718820918047,12.406442573537531,169.47747876972875,168.98014604984655,0.78331539675085571,31.304159669169106,52.241417690908506,0,0,0,20.639034396010587,19.191389719205969,8.2366479481570679E-2,null,null,null,481.47210840908093,463.00882226585958,1.9871623273212857,502.1111428050915,482.20021198506555,2.0695288068028566,0,0,0,502.1111428050915,482.20021198506555,2.0695288068028566]
[20090521,"Example 1",234,230.67704800000001,226.10498918323214,0,0.32674443311916351,36.678905372932746,0,0.17092004567492841,28.179660639443874,0,229.05235610945991,220.14701210447799,2.1592330060406186,1.5010546176298833,9.8407953678627926,9.7890381177202617,4.5857126232397301E-2,26.736177084319536,52.855442603841595,null,null,null,null,null,null,null,null,null,234,228.06875340257153,36.313159887903737,12.288009570345114,168.07716078059727,167.59247914945394,0.78322282809267429,31.320965425659477,52.448458521322948,0,0,0,20.654326373321098,19.204405812804247,8.2070110311129263E-2,null,null,null,481.53543348385642,463.05467921935372,1.9788661505100587,502.18975985717753,482.25908503215794,2.0609362608211876,0,0,0,502.18975985717753,482.25908503215794,2.0609362608211876]
[20090521,"Example 1",235,231.67704800000001,227.10498918323214,0,0.32032993413362115,36.431142620440177,0,0.17115557310217472,28.218437272860648,0,230.05235610945991,221.14701210447799,2.1592690081171408,1.4785562666170906,9.7288441131162617,9.6787880592242832,4.5706661115478713E-2,26.757226589447907,53.159123634090037,null,null,null,null,null,null,null,null,null,235,229.06875340257153,36.299107517242788,12.170930600326978,166.69397974927543,166.22158118917977,0.78313776578234651,31.33762389258964,52.65541927829959,0,0,0,20.669472140809283,19.217267530078413,8.1775606510971974E-2,null,null,null,481.59608154372086,463.09794371443786,1.9706295477210121,502.26555368453012,482.31521124451626,2.0524051542319839,0,0,0,502.26555368453012,482.31521124451626,2.0524051542319839]
[20090521,"Example 1",236,232.67704800000001,228.10498918323214,0,0.31405479227779648,36.184004454427466,0,0.17138240623244511,28.256998750309897,0,231.05235610945991,222.14701210447799,2.1593035048909552,1.4564215419322997,9.6185519499607111,9.5701365289409583,4.5557439053828641E-2,26.778092331777849,53.463459393255853,null,null,null,null,null,null,null,null,null,236,230.06875340257153,36.285031382159765,12.055188761181611,165.32765964212527,164.86718818636328,0.78306015471372625,31.354136926291677,52.862299611106977,0,0,0,20.684473921970969,19.229977660002625,8.1482956186451794E-2,null,null,null,481.6540858076383,463.13865028567699,1.9624519079901568,502.33855972960924,482.36862794567963,2.0439348641766086,0,0,0,502.33855972960924,482.36862794567963,2.0439348641766086]
[20090521,"Example 1",237,233.67704800000001,229.10498918323214,0,0.30791581904728355,35.937515394236144,0,0.17160061107550256,28.295346969730506,0,232.05235610945991,223.14701210447799,2.1593365585667308,1.4346447852964408,9.5098893081996714,9.4630562724605358,4.5409450226188572E-2,26.798776581689992,53.768447530203069,null,null,null,null,null,null,null,null,null,237,231.06875340257153,36.27093175759682,11.940767351425503,163.97792991029465,163.52904120471641,0.78298993869830891,31.370506352843734,53.069099170018184,0,0,0,20.699333891399604,19.242538921148729,8.1192147346619115E-2,null,null,null,481.70947888733048,463.17683278360192,1.954332627778911,502.40881277873007,482.41937170475063,2.0355247751255301,0,0,0,502.40881277873007,482.41937170475063,2.0355247751255301]
[20090521,"Example 1",238,234.67704800000001,230.10498918323214,0,0.30190989678839109,35.691699456283672,0,0.17181025477402495,28.333483806110248,0,233.05235610945991,224.14701210447799,2.1593682288161471,1.4132203982803129,9.4028272158917137,9.357520539278239,4.5262684718535451E-2,26.819281573744778,54.074085710880773,null,null,null,null,null,null,null,null,null,238,232.06875340257153,36.256808908913833,11.827649869033381,162.64452536070539,162.20688624283721,0.78292706050743954,31.386733968671148,53.275817606378858,0,0,0,20.714054176151745,19.254953963861457,8.0903167915384266E-2,null,null,null,481.76229280219519,463.21252439294744,1.9462711108947373,502.47634697834695,482.4674783568089,2.0271742788101212,0,0,0,502.47634697834695,482.4674783568089,2.0271742788101212]
[20090521,"Example 1",239,235.67704800000001,231.10498918323214,0,0.29603397747468141,35.446580151449119,0,0.17201140555303054,28.371411111838263,0,234.05235610945991,225.14701210447799,2.1593985728790956,1.3921428433102387,9.2973372863376404,9.2535030738453603,4.5117132532689654E-2,26.839609507363306,54.380371618264611,null,null,null,null,null,null,null,null,null,239,233.06875340257153,36.242663092306444,11.715820010035991,161.32718603052979,160.90047412544953,0.78287146191427981,31.402821541133598,53.482454572671614,0,0,0,20.72863685707015,19.267225372359402,8.0616005742089547E-2,null,null,null,481.81255899376731,463.24575765028851,1.9382667684112489,502.54119585083748,482.51298302264792,2.0188827741533384,0,0,0,502.54119585083748,482.51298302264792,2.0188827741533384]
[20090521,"Example 1",240,236.67704800000001,232.10498918323214,0,0.29028508147732834,35.202180482876201,0,0.17220413266990331,28.409130717050999,0,235.05235610945991,226.14701210447799,2.1594276456609403,1.371406644565025,9.1933917053502174,9.1509781067192684,4.4972783594602113E-2,26.859762547493126,54.687302952295489,null,null,null,null,null,null,null,null,null,240,234.06875340257153,36.228494555205359,11.605261667078235,160.02565706505155,159.60956039729942,0.78282308373549458,31.418770809098611,53.689009722576586,0,0,0,20.743083970065722,19.279355666764307,8.0330648611517938E-2,null,null,null,481.86030833974377,463.27656446110001,1.9303190185879167,502.60339230980946,482.55592012786434,2.0106496671994347,0,0,0,502.60339230980946,482.55592012786434,2.0106496671994347]
[20090521,"Example 1",241,237.67704800000001,233.10498918323214,0,0.28466029633171797,34.958522944183755,0,0.17238850636503433,28.446644429971691,0,236.05235610945991,227.14701210447799,2.1594554998259836,1.3510063887694894,9.0909632188016154,9.0499203458161883,4.4829627762331202E-2,26.879742825259378,54.994877429814558,null,null,null,null,null,null,null,null,null,241,235.06875340257153,36.214303536657745,11.495958927940675,158.73968859880992,158.3339052196427,0.78278186587263443,31.434583483501726,53.895482711027867,0,0,0,20.757397507359556,19.291347305061198,8.0047084253365972E-2,null,null,null,481.90557116758185,463.30497611625924,1.9224272867894574,502.6629686749414,482.59632342132045,2.0024743710428234,0,0,0,502.6629686749414,482.59632342132045,2.0024743710428234]
[20090521,"Example 1",242,238.67704800000001,234.10498918323214,0,0.27915677550251289,34.715629518076661,0,0.17256459781310785,28.483954037243731,0,237.05235610945991,228.14701210447799,2.1594821858872835,1.3309367258894491,8.9900251204429544,8.9503049677692967,4.4687654833716076E-2,26.89955243860166,55.303092784495945,null,null,null,null,null,null,null,null,null,242,236.06875340257153,36.200090267691472,11.387896074027108,157.46903563992691,157.07327326925494,0.78274774735317609,31.450261247893735,54.101873194266162,0,0,0,20.771579418686393,19.303202684991845,7.9765300351205978E-2,null,null,null,481.94837726768816,463.33102330801097,1.9145910054050039,502.71995668637453,482.63422599300281,1.9943563057562099,0,0,0,502.71995668637453,482.63422599300281,1.9943563057562099]
[20090521,"Example 1",243,239.67704800000001,235.10498918323214,0,0.27377173714924702,34.473521675346078,0,0.17273247907505426,28.521061304257664,0,238.05235610945991,229.14701210447799,2.1595077522929573,1.3111923697331445,8.8905512399910975,8.8521076093951514,4.4546854553757842E-2,26.919193452897115,55.611946766776718,null,null,null,null,null,null,null,null,null,243,237.06875340257153,36.185854971662991,11.281057578820409,156.21345795751583,155.82743363989277,0.78272066637118787,31.465805758975442,54.308180829888919,0,0,0,20.785631612460847,19.314924145884074,7.9485284550963264E-2,null,null,null,481.98875590621378,463.35473614541951,1.9068096137671584,502.77438751867464,482.66966029130356,1.9862948983181217,0,0,0,502.77438751867464,482.66966029130356,1.9862948983181217]
[20090521,"Example 1",244,240.67704800000001,236.10498918323214,0,0.2685024628943512,34.232220374251987,0,0.1728922230506782,28.557967975472312,0,239.05235610945991,230.14701210447799,2.1595322455091051,1.291768098463751,8.7925159314777108,8.755304359270859,4.4407216621714769E-2,26.938667901569794,55.921437143783706,null,null,null,null,null,null,null,null,null,244,238.06875340257153,36.171597864589614,11.175428106309949,154.97271997209162,154.59615974615679,0.78270056032760704,31.481218647119974,54.514405276895708,0,0,0,20.799555956907199,19.326513970418794,7.9207024468929479E-2,null,null,null,482.02673583746622,463.37614416932223,1.8990825580709927,502.82629179437345,482.702658139741,1.978289582539922,0,0,0,502.82629179437345,482.702658139741,1.978289582539922]
[20090521,"Example 1",245,241.67704800000001,237.10498918323214,0,0.26334629659532865,33.991746060277137,0,0.17304390343199594,28.594675774730014,0,240.05235610945991,231.14701210447799,2.1595557100994802,1.2726587550275141,8.6958940618551868,8.6598717494236688,4.4268730697921296E-2,26.957977786686865,56.231561699258407,null,null,null,null,null,null,null,null,null,245,239.06875340257153,36.157319155466816,11.070992509392214,153.74659064887811,153.37922922967832,0.7826873658700827,31.496501516883292,54.720546195731515,0,0,0,20.813354281154336,19.33797438633739,7.893050769933628E-2,null,null,null,482.06234531595271,463.39527636680458,1.89140929129308,502.87569959710703,482.73325075314199,1.9703397989924163,0,0,0,502.87569959710703,482.73325075314199,1.9703397989924163]
[20090521,"Example 1",246,242.67704800000001,238.10498918323214,0,0.25830064312268797,33.752118666243277,0,0.17318759465728872,28.631186405566122,0,241.05235610945991,232.14701210447799,2.1595781888020333,1.2538592475018928,8.6006609998547319,8.565786747135034,4.4131386410338848E-2,26.977125079541935,56.542318233479051,null,null,null,null,null,null,null,null,null,246,240.06875340257153,36.143019046571297,10.967735828247088,152.5348433939339,152.17642386757848,0.78268101893237252,31.511655947503023,54.926603248326941,0,0,0,20.827028376296713,19.349307568091351,7.8655721821509553E-2,null,null,null,482.09561210806805,463.41216118521567,1.8837892731106327,502.92264048436476,482.76146875330704,1.9624449949321425,0,0,0,502.92264048436476,482.76146875330704,1.9624449949321425]
[20090521,"Example 1",247,243.67704800000001,239.10498918323214,0,0.25336296714508438,33.513357612779913,0,0.17332337186588492,28.6675015515127,0,242.05235610945991,233.14701210447799,2.159599722602445,1.2353645493679521,8.5067926050915101,8.4730267468604445,4.3995173360844672E-2,26.996111721225688,56.853704563180351,null,null,null,null,null,null,null,null,null,247,241.06875340257153,36.128697733750386,10.865643288692542,151.33725595301738,150.98752948314464,0.78268145477327045,31.526683493386003,55.132576098134201,0,0,0,20.840579996422424,19.360515638436254,7.8382654406624508E-2,null,null,null,482.1265635034386,463.42682654573923,1.8762219698208067,502.96714349986104,482.78734218417549,1.9546046242274311,0,0,0,502.96714349986104,482.78734218417549,1.9546046242274311]
[20090521,"Example 1",248,244.67704800000001,240.10498918323214,0,0.24853079192299593,33.275481809135492,0,0.17345131085369864,28.703622876397006,0,243.05235610945991,234.14701210447799,2.1596203508047638,1.2171696997110368,8.4142652174117618,8.3815695622660265,4.3860081131269095E-2,27.014939623184375,57.165718521471362,null,null,null,null,null,null,null,null,null,248,242.06875340257153,36.114355406698451,10.764700300518854,150.1536103130951,149.81233585865314,0.78268860801503226,31.541585684584675,55.338464410162139,0,0,0,20.854010859609541,19.371600669972047,7.8111293024080833E-2,null,null,null,482.15522632593337,463.43929985653739,1.8687068542602314,503.00923718554293,482.81090052650944,1.9468181472843122,0,0,0,503.00923718554293,482.81090052650944,1.9468181472843122]
[20090521,"Example 1",249,245.67704800000001,241.10498918323214,0,0.2438016981121324,33.038509654321039,0,0.1735714880295228,28.739552024634339,0,244.05235610945991,235.14701210447799,2.1596401110992591,1.1992698033537204,8.3230556464773784,8.2913934183832421,4.3726099289186859E-2,27.033610667766123,57.478357957750525,null,null,null,null,null,null,null,null,null,249,243.06875340257153,36.099992249220854,10.664892455805175,148.98369260643065,148.65063665029692,0.78270241268129037,31.556364027262955,55.544267851007191,0,0,0,20.867322648891594,19.382564686631515,7.7841625247516116E-2,null,null,null,482.18162694435523,463.44960802548292,1.861243405724831,503.04894959324685,482.83217271211441,1.9390850309723471,0,0,0,503.04894959324685,482.83217271211441,1.9390850309723471]
[20090521,"Example 1",250,246.67704800000001,242.10498918323214,0,0.23917332257768109,32.802459038575961,0,0.17368398037209756,28.77529062151574,0,245.05235610945991,236.14701210447799,2.1596590396275972,1.1816600309246648,8.2331411615825445,8.2024769438817859,4.3593217393469219E-2,27.052126708755782,57.791620737619652,null,null,null,null,null,null,null,null,null,250,244.06875340257153,36.085608439486016,10.566205527219889,147.82729301716952,147.50222930515628,0.78272280223443313,31.571020004151393,55.749986088882331,0,0,0,20.880517013193366,19.393409665118938,7.7573638660475758E-2,null,null,null,482.20579128282094,463.45777747249304,1.8538311098899722,503.08630829601429,482.85118713761199,1.931404748550448,0,0,0,503.08630829601429,482.85118713761199,1.931404748550448]

{"sheet":"GYPSY_Report","index":11,"n_rows":197,"n_cols":9,"rows_kept":197,"cut":false,"hidden":false,"merged":[[0,2,3,8],[7,2,7,4],[168,0,170,0],[165,0,167,8],[168,1,169,3],[168,4,169,6],[168,7,169,8],[15,6,15,8],[16,6,16,8],[17,6,17,8],[18,6,18,8],[19,6,19,8],[9,7,9,8]]}
[null,null,"Yield Table Generator Report"]
[]
[]
[]
[]
["Forecast Values",null,null,null,null,"Compiler Information"]
[]
["Stand Id:",null,{"$f":"IF(GYPSY_Observed!A1=\"\",\"No GYPSY Output!\",GYPSY_Observed!B2)","v":"Example 1"},null,null,"GYPSY Model:",null,"2009-May-21"]
["Stand Type:",null,{"$f":"GYPSY_Observed!C2","v":"Regenerated"},null,null,"COM DLL:",null,"20100329b35"]
["Stand Age:",null,{"$f":"GYPSY_Observed!D2","v":18},"years",null,"Application Version:",null,"2022-08-03p"]
["Spatial:",null,{"$f":"IF(GYPSY_Observed!E2=\"Y\",\"YES\",\"NO\")","v":"YES"}]
["BA adjusted:",null,{"$f":"IF(GYPSY_Observed!F2=\"Y\",\"YES\",\"NO\")","v":"YES"}]
[]
["Input Data"]
[]
["species","totage","topht","den","ps","ba","     utilization"]
["AW",{"$f":"GYPSY_Observed!S2","v":14.677047999999999},{"$f":"GYPSY_Observed!U2","v":4.7073957233422785},{"$f":"GYPSY_Observed!V2","v":65.030372066602467},{"$f":"GYPSY_Observed!W2","v":5.0171439792905419},{"$f":"GYPSY_Observed!X2","v":2.820191017362049E-2},{"$f":"\"     \" & GYPSY_Observed!G2&\"/\"&GYPSY_Observed!H2&\"/\"&TEXT(100*GYPSY_Observed!I2,\"00\")","v":"     15/10/30"}]
["PL",{"$f":"GYPSY_Observed!AK2","v":18},{"$f":"GYPSY_Observed!AM2","v":6.9609955846903686},{"$f":"GYPSY_Observed!AN2","v":5167.6862479595493},{"$f":"GYPSY_Observed!AO2","v":84.510732899765955},{"$f":"GYPSY_Observed!AP2","v":10.982059293254114},{"$f":"\"     \" & GYPSY_Observed!P2&\"/\"&GYPSY_Observed!Q2&\"/\"&TEXT(100*GYPSY_Observed!R2,\"00\")","v":"     15/10/30"}]
["SB",{"$f":"IF(GYPSY_Observed!Y2=0,\"\",GYPSY_Observed!Y2)","v":13.052356109459904},{"$f":"IF(B19=\"\",\"\",GYPSY_Observed!AA2)","v":2.4509417377259188},{"$f":"IF(B19=\"\",\"\",GYPSY_Observed!AB2)","v":144.70370867837411},{"$f":"IF(B19=\"\",\"\",GYPSY_Observed!AC2)","v":11.034868883442488},null,{"$f":"IF(B19=\"\",\"\",\"     \" & GYPSY_Observed!J2&\"/\"&GYPSY_Observed!K2&\"/\"&TEXT(100*GYPSY_Observed!L2,\"00\"))","v":"     15/10/30"}]
["SW",{"$f":"IF(GYPSY_Observed!AE2=0,\"\",GYPSY_Observed!AE2)","v":11.518197366550488},{"$f":"IF(B20=\"\",\"\",GYPSY_Observed!AG2)","v":2.2349535670063823},{"$f":"IF(B20=\"\",\"\",GYPSY_Observed!AH2)","v":0},{"$f":"IF(B20=\"\",\"\",GYPSY_Observed!AI2)","v":2.8545186017877908},null,{"$f":"IF(B20=\"\",\"\",\"     \" & GYPSY_Observed!M2&\"/\"&GYPSY_Observed!N2&\"/\"&TEXT(100*GYPSY_Observed!O2,\"00\"))","v":"     15/10/30"}]
[]
["Calculated Attributes"]
[]
["species","bhage","y2bh","si_bh","si_t","sdf","psi"]
["AW",{"$f":"GYPSY_Observed!T2","v":10.10498918323211},{"$f":"GYPSY_Observed!AS2","v":4.5720588167678899},{"$f":"GYPSY_Observed!AQ2","v":14.067793469477509},{"$f":"GYPSY_Observed!AR2","v":13.260344882748713},{"$f":"GYPSY_Observed!AT2","v":64.771947664646873},{"$f":"GYPSY_Observed!AV2","v":4.9045698876871189}]
["PL",{"$f":"GYPSY_Observed!AL2","v":12.068753402571524},{"$f":"GYPSY_Observed!BK2","v":5.9312465974284772},{"$f":"GYPSY_Observed!BI2","v":20.049010443684356},{"$f":"GYPSY_Observed!BJ2","v":18.687423246015076},{"$f":"GYPSY_Observed!BL2","v":2330.1163337089283},{"$f":"GYPSY_Observed!BN2","v":73.340101764448235}]
["SB",{"$f":"IF(B19=\"\",\"\",GYPSY_Observed!Z2)","v":4.1470121044779908},{"$f":"IF(B19=\"\",\"\",GYPSY_Observed!AY2)","v":8.905344004981913},{"$f":"IF(B19=\"\",\"\",GYPSY_Observed!AW2)","v":15.117821560259445},{"$f":"IF(B19=\"\",\"\",GYPSY_Observed!AX2)","v":13.245928359043438},{"$f":"IF(B19=\"\",\"\",GYPSY_Observed!AZ2)","v":121.75728304017301},{"$f":"IF(B19=\"\",\"\",GYPSY_Observed!BB2)","v":10.68406033311998}]
["SW",{"$f":"IF(B20=\"\",\"\",GYPSY_Observed!AF2)","v":3.1790316389524271},{"$f":"IF(B20=\"\",\"\",GYPSY_Observed!BE2)","v":8.3391657275980613},{"$f":"IF(B20=\"\",\"\",GYPSY_Observed!BC2)","v":16.51429314237436},{"$f":"IF(B20=\"\",\"\",GYPSY_Observed!BD2)","v":14.435052455161349},{"$f":"IF(B20=\"\",\"\",GYPSY_Observed!BF2)","v":0},{"$f":"IF(B20=\"\",\"\",GYPSY_Observed!BH2)","v":2.8115491993055803}]
[]
["Volume & Yield Information"]
[]
["species","culm.\nMAI","stand age\n@ PL culm.",null,null,"species\ngroup","culm.\nMAI","culm.\nstand age","sec.\nMAI"]
["AW",{"$f":"IF(C34=\"\",\"\",INDEX(GYPSY_Projected!BE2:BE252,C34+1))","v":1.8171901995712149E-2},null,null,null,"Coniferous",{"$f":"IF(GYPSY_Projected!A1=\"\",\"\",MAX(GYPSY_Projected!BB2:BB252))","v":4.1463403157982315},{"$f":"IF(G33=\"\",\"\",MATCH(G33,GYPSY_Projected!BB2:BB252,0)-1)","v":84},{"$f":"IF(H33=\"\",\"\",INDEX(GYPSY_Projected!BE2:BE252,H33+1))","v":1.6647022560313491E-2}]
["PL",{"$f":"IF(GYPSY_Projected!A1=\"\",\"\",MAX(GYPSY_Projected!AY2:AY252))","v":4.0475622535660287},{"$f":"IF(B34=\"\",\"\",MATCH(B34,GYPSY_Projected!AY2:AY252,0)-1)","v":83},null,null,"Deciduous",{"$f":"IF(GYPSY_Projected!A1=\"\",\"\",MAX(GYPSY_Projected!BE2:BE252))","v":3.5919290527870434E-2},{"$f":"IF(G34=\"\",\"\",MATCH(G34,GYPSY_Projected!BE2:BE252,0)-1)","v":64},{"$f":"IF(H34=\"\",\"\",INDEX(GYPSY_Projected!BB2:BB252,H34+1))","v":3.5531712764073204}]
["SB",{"$f":"IF(C34=\"\",\"\",INDEX(GYPSY_Projected!AS2:AS252,C34+1))","v":9.7855670942654807E-2}]
["SW",{"$f":"IF(C34=\"\",\"\",INDEX(GYPSY_Projected!AV2:AV252,C34+1))","v":0}]
[]
[]
[]
[]
[]
[]
[]
[]
[]
[]
[]
[]
[]
[]
[]
[]
[]
[]
[]
[]
[]
[]
[]
[]
[]
[]
[]
[]
[]
[]
[]
[]
[]
[]
[]
[]
[]
[]
[]
[]
[]
[]
[]
[]
[]
[]
[]
[]
[]
[]
[]
[]
[]
[]
[]
[]
[]
[]
[]
[]
[]
[]
[]
[]
[]
[]
[]
[]
[]
[]
[]
[]
[]
[]
[]
[]
[]
[]
[]
[]
[]
[]
[]
[]
[]
[]
[]
[]
[]
[]
[]
[]
[]
[]
[]
[]
[]
[]
[]
[]
[]
[]
[]
[]
[]
[]
[]
[]
[]
[]
[]
[]
[]
[]
[]
[]
[]
[]
[]
[]
[]
[]
[]
[]
[]
[]
[]
[]
[]
[{"$f":"\"Yield Table for Stand Id: \" & C8","v":"Yield Table for Stand Id: Example 1"}]
[]
[]
["Stand\nAge","Coniferous",null,null,"Deciduous",null,null,"Total"]
[]
[null,"mvol","mai","pc. size","mvol","mai","pc. size","mvol","mai"]
["years","m3/ha","m3/ha/yr","trees/m3","m3/ha","m3/ha/yr","trees/m3","m3/ha","m3/ha/yr"]
[10,{"$f":"IF(ISNA(VLOOKUP($A173,GYPSY_Projected!$C$1:$BH$252,51,FALSE)),\"\",VLOOKUP($A173,GYPSY_Projected!$C$1:$BH$252,51,FALSE))","v":0},{"$f":"IF(ISNA(VLOOKUP($A173,GYPSY_Projected!$C$1:$BH$252,52,FALSE)),\"\",VLOOKUP($A173,GYPSY_Projected!$C$1:$BH$252,52,FALSE))","v":0},{"$f":"IF(ISNA(IF(B173>=5,VLOOKUP($A173,GYPSY_Projected!$C$1:$BH$252,34,FALSE)/B173,0)),\"\",IF(B173>=5,(VLOOKUP($A173,GYPSY_Projected!$C$1:$BH$252,16,FALSE)+VLOOKUP($A173,GYPSY_Projected!$C$1:$BH$252,25,FALSE)+VLOOKUP($A173,GYPSY_Projected!$C$1:$BH$252,34,FALSE))/B173,\"\"))","v":""},{"$f":"IF(ISNA(VLOOKUP($A173,GYPSY_Projected!$C$1:$BH$252,54,FALSE)),\"\",VLOOKUP($A173,GYPSY_Projected!$C$1:$BH$252,54,FALSE))","v":0},{"$f":"IF(ISNA(VLOOKUP($A173,GYPSY_Projected!$C$1:$BH$252,55,FALSE)),\"\",VLOOKUP($A173,GYPSY_Projected!$C$1:$BH$252,55,FALSE))","v":0},{"$f":"IF(ISNA(IF(E173>=5,VLOOKUP($A173,GYPSY_Projected!$C$1:$BH$252,7,FALSE)/E173,0)),\"\",IF(E173>=5,VLOOKUP($A173,GYPSY_Projected!$C$1:$BH$252,7,FALSE)/E173,\"\"))","v":""},{"$f":"IF(ISNA(VLOOKUP($A173,GYPSY_Projected!$C$1:$BH$252,57,FALSE)),\"\",VLOOKUP($A173,GYPSY_Projected!$C$1:$BH$252,57,FALSE))","v":0},{"$f":"IF(ISNA(VLOOKUP($A173,GYPSY_Projected!$C$1:$BH$252,58,FALSE)),\"\",VLOOKUP($A173,GYPSY_Projected!$C$1:$BH$252,58,FALSE))","v":0}]
[20,{"$f":"IF(ISNA(VLOOKUP($A174,GYPSY_Projected!$C$1:$BH$252,51,FALSE)),\"\",VLOOKUP($A174,GYPSY_Projected!$C$1:$BH$252,51,FALSE))","v":0.2402764077555519},{"$f":"IF(ISNA(VLOOKUP($A174,GYPSY_Projected!$C$1:$BH$252,52,FALSE)),\"\",VLOOKUP($A174,GYPSY_Projected!$C$1:$BH$252,52,FALSE))","v":1.2013820387777594E-2},{"$f":"IF(ISNA(IF(B174>=5,VLOOKUP($A174,GYPSY_Projected!$C$1:$BH$252,34,FALSE)/B174,0)),\"\",IF(B174>=5,(VLOOKUP($A174,GYPSY_Projected!$C$1:$BH$252,16,FALSE)+VLOOKUP($A174,GYPSY_Projected!$C$1:$BH$252,25,FALSE)+VLOOKUP($A174,GYPSY_Projected!$C$1:$BH$252,34,FALSE))/B174,\"\"))","v":""},{"$f":"IF(ISNA(VLOOKUP($A174,GYPSY_Projected!$C$1:$BH$252,54,FALSE)),\"\",VLOOKUP($A174,GYPSY_Projected!$C$1:$BH$252,54,FALSE))","v":8.3845492303392802E-5},{"$f":"IF(ISNA(VLOOKUP($A174,GYPSY_Projected!$C$1:$BH$252,55,FALSE)),\"\",VLOOKUP($A174,GYPSY_Projected!$C$1:$BH$252,55,FALSE))","v":4.19227461516964E-6},{"$f":"IF(ISNA(IF(E174>=5,VLOOKUP($A174,GYPSY_Projected!$C$1:$BH$252,7,FALSE)/E174,0)),\"\",IF(E174>=5,VLOOKUP($A174,GYPSY_Projected!$C$1:$BH$252,7,FALSE)/E174,\"\"))","v":""},{"$f":"IF(ISNA(VLOOKUP($A174,GYPSY_Projected!$C$1:$BH$252,57,FALSE)),\"\",VLOOKUP($A174,GYPSY_Projected!$C$1:$BH$252,57,FALSE))","v":0.24036025324785529},{"$f":"IF(ISNA(VLOOKUP($A174,GYPSY_Projected!$C$1:$BH$252,58,FALSE)),\"\",VLOOKUP($A174,GYPSY_Projected!$C$1:$BH$252,58,FALSE))","v":1.2018012662392764E-2}]
[30,{"$f":"IF(ISNA(VLOOKUP($A175,GYPSY_Projected!$C$1:$BH$252,51,FALSE)),\"\",VLOOKUP($A175,GYPSY_Projected!$C$1:$BH$252,51,FALSE))","v":5.1645810778632768},{"$f":"IF(ISNA(VLOOKUP($A175,GYPSY_Projected!$C$1:$BH$252,52,FALSE)),\"\",VLOOKUP($A175,GYPSY_Projected!$C$1:$BH$252,52,FALSE))","v":0.17215270259544255},{"$f":"IF(ISNA(IF(B175>=5,VLOOKUP($A175,GYPSY_Projected!$C$1:$BH$252,34,FALSE)/B175,0)),\"\",IF(B175>=5,(VLOOKUP($A175,GYPSY_Projected!$C$1:$BH$252,16,FALSE)+VLOOKUP($A175,GYPSY_Projected!$C$1:$BH$252,25,FALSE)+VLOOKUP($A175,GYPSY_Projected!$C$1:$BH$252,34,FALSE))/B175,\"\"))","v":83.596417508138785},{"$f":"IF(ISNA(VLOOKUP($A175,GYPSY_Projected!$C$1:$BH$252,54,FALSE)),\"\",VLOOKUP($A175,GYPSY_Projected!$C$1:$BH$252,54,FALSE))","v":3.4235441584313651E-2},{"$f":"IF(ISNA(VLOOKUP($A175,GYPSY_Projected!$C$1:$BH$252,55,FALSE)),\"\",VLOOKUP($A175,GYPSY_Projected!$C$1:$BH$252,55,FALSE))","v":1.1411813861437884E-3},{"$f":"IF(ISNA(IF(E175>=5,VLOOKUP($A175,GYPSY_Projected!$C$1:$BH$252,7,FALSE)/E175,0)),\"\",IF(E175>=5,VLOOKUP($A175,GYPSY_Projected!$C$1:$BH$252,7,FALSE)/E175,\"\"))","v":""},{"$f":"IF(ISNA(VLOOKUP($A175,GYPSY_Projected!$C$1:$BH$252,57,FALSE)),\"\",VLOOKUP($A175,GYPSY_Projected!$C$1:$BH$252,57,FALSE))","v":5.1988165194475906},{"$f":"IF(ISNA(VLOOKUP($A175,GYPSY_Projected!$C$1:$BH$252,58,FALSE)),\"\",VLOOKUP($A175,GYPSY_Projected!$C$1:$BH$252,58,FALSE))","v":0.17329388398158635}]
[40,{"$f":"IF(ISNA(VLOOKUP($A176,GYPSY_Projected!$C$1:$BH$252,51,FALSE)),\"\",VLOOKUP($A176,GYPSY_Projected!$C$1:$BH$252,51,FALSE))","v":32.690527807038784},{"$f":"IF(ISNA(VLOOKUP($A176,GYPSY_Projected!$C$1:$BH$252,52,FALSE)),\"\",VLOOKUP($A176,GYPSY_Projected!$C$1:$BH$252,52,FALSE))","v":0.81726319517596957},{"$f":"IF(ISNA(IF(B176>=5,VLOOKUP($A176,GYPSY_Projected!$C$1:$BH$252,34,FALSE)/B176,0)),\"\",IF(B176>=5,(VLOOKUP($A176,GYPSY_Projected!$C$1:$BH$252,16,FALSE)+VLOOKUP($A176,GYPSY_Projected!$C$1:$BH$252,25,FALSE)+VLOOKUP($A176,GYPSY_Projected!$C$1:$BH$252,34,FALSE))/B176,\"\"))","v":29.355729894981344},{"$f":"IF(ISNA(VLOOKUP($A176,GYPSY_Projected!$C$1:$BH$252,54,FALSE)),\"\",VLOOKUP($A176,GYPSY_Projected!$C$1:$BH$252,54,FALSE))","v":0.37314892457076076},{"$f":"IF(ISNA(VLOOKUP($A176,GYPSY_Projected!$C$1:$BH$252,55,FALSE)),\"\",VLOOKUP($A176,GYPSY_Projected!$C$1:$BH$252,55,FALSE))","v":9.3287231142690184E-3},{"$f":"IF(ISNA(IF(E176>=5,VLOOKUP($A176,GYPSY_Projected!$C$1:$BH$252,7,FALSE)/E176,0)),\"\",IF(E176>=5,VLOOKUP($A176,GYPSY_Projected!$C$1:$BH$252,7,FALSE)/E176,\"\"))","v":""},{"$f":"IF(ISNA(VLOOKUP($A176,GYPSY_Projected!$C$1:$BH$252,57,FALSE)),\"\",VLOOKUP($A176,GYPSY_Projected!$C$1:$BH$252,57,FALSE))","v":33.063676731609547},{"$f":"IF(ISNA(VLOOKUP($A176,GYPSY_Projected!$C$1:$BH$252,58,FALSE)),\"\",VLOOKUP($A176,GYPSY_Projected!$C$1:$BH$252,58,FALSE))","v":0.8265919182902387}]
[50,{"$f":"IF(ISNA(VLOOKUP($A177,GYPSY_Projected!$C$1:$BH$252,51,FALSE)),\"\",VLOOKUP($A177,GYPSY_Projected!$C$1:$BH$252,51,FALSE))","v":101.70387542226962},{"$f":"IF(ISNA(VLOOKUP($A177,GYPSY_Projected!$C$1:$BH$252,52,FALSE)),\"\",VLOOKUP($A177,GYPSY_Projected!$C$1:$BH$252,52,FALSE))","v":2.0340775084453924},{"$f":"IF(ISNA(IF(B177>=5,VLOOKUP($A177,GYPSY_Projected!$C$1:$BH$252,34,FALSE)/B177,0)),\"\",IF(B177>=5,(VLOOKUP($A177,GYPSY_Projected!$C$1:$BH$252,16,FALSE)+VLOOKUP($A177,GYPSY_Projected!$C$1:$BH$252,25,FALSE)+VLOOKUP($A177,GYPSY_Projected!$C$1:$BH$252,34,FALSE))/B177,\"\"))","v":12.222370657928707},{"$f":"IF(ISNA(VLOOKUP($A177,GYPSY_Projected!$C$1:$BH$252,54,FALSE)),\"\",VLOOKUP($A177,GYPSY_Projected!$C$1:$BH$252,54,FALSE))","v":1.2191707025218124},{"$f":"IF(ISNA(VLOOKUP($A177,GYPSY_Projected!$C$1:$BH$252,55,FALSE)),\"\",VLOOKUP($A177,GYPSY_Projected!$C$1:$BH$252,55,FALSE))","v":2.4383414050436248E-2},{"$f":"IF(ISNA(IF(E177>=5,VLOOKUP($A177,GYPSY_Projected!$C$1:$BH$252,7,FALSE)/E177,0)),\"\",IF(E177>=5,VLOOKUP($A177,GYPSY_Projected!$C$1:$BH$252,7,FALSE)/E177,\"\"))","v":""},{"$f":"IF(ISNA(VLOOKUP($A177,GYPSY_Projected!$C$1:$BH$252,57,FALSE)),\"\",VLOOKUP($A177,GYPSY_Projected!$C$1:$BH$252,57,FALSE))","v":102.92304612479143},{"$f":"IF(ISNA(VLOOKUP($A177,GYPSY_Projected!$C$1:$BH$252,58,FALSE)),\"\",VLOOKUP($A177,GYPSY_Projected!$C$1:$BH$252,58,FALSE))","v":2.0584609224958283}]
[60,{"$f":"IF(ISNA(VLOOKUP($A178,GYPSY_Projected!$C$1:$BH$252,51,FALSE)),\"\",VLOOKUP($A178,GYPSY_Projected!$C$1:$BH$252,51,FALSE))","v":193.0338155222959},{"$f":"IF(ISNA(VLOOKUP($A178,GYPSY_Projected!$C$1:$BH$252,52,FALSE)),\"\",VLOOKUP($A178,GYPSY_Projected!$C$1:$BH$252,52,FALSE))","v":3.2172302587049315},{"$f":"IF(ISNA(IF(B178>=5,VLOOKUP($A178,GYPSY_Projected!$C$1:$BH$252,34,FALSE)/B178,0)),\"\",IF(B178>=5,(VLOOKUP($A178,GYPSY_Projected!$C$1:$BH$252,16,FALSE)+VLOOKUP($A178,GYPSY_Projected!$C$1:$BH$252,25,FALSE)+VLOOKUP($A178,GYPSY_Projected!$C$1:$BH$252,34,FALSE))/B178,\"\"))","v":6.6554637979985536},{"$f":"IF(ISNA(VLOOKUP($A178,GYPSY_Projected!$C$1:$BH$252,54,FALSE)),\"\",VLOOKUP($A178,GYPSY_Projected!$C$1:$BH$252,54,FALSE))","v":2.09387930286442},{"$f":"IF(ISNA(VLOOKUP($A178,GYPSY_Projected!$C$1:$BH$252,55,FALSE)),\"\",VLOOKUP($A178,GYPSY_Projected!$C$1:$BH$252,55,FALSE))","v":3.489798838107367E-2},{"$f":"IF(ISNA(IF(E178>=5,VLOOKUP($A178,GYPSY_Projected!$C$1:$BH$252,7,FALSE)/E178,0)),\"\",IF(E178>=5,VLOOKUP($A178,GYPSY_Projected!$C$1:$BH$252,7,FALSE)/E178,\"\"))","v":""},{"$f":"IF(ISNA(VLOOKUP($A178,GYPSY_Projected!$C$1:$BH$252,57,FALSE)),\"\",VLOOKUP($A178,GYPSY_Projected!$C$1:$BH$252,57,FALSE))","v":195.12769482516032},{"$f":"IF(ISNA(VLOOKUP($A178,GYPSY_Projected!$C$1:$BH$252,58,FALSE)),\"\",VLOOKUP($A178,GYPSY_Projected!$C$1:$BH$252,58,FALSE))","v":3.2521282470860053}]
[70,{"$f":"IF(ISNA(VLOOKUP($A179,GYPSY_Projected!$C$1:$BH$252,51,FALSE)),\"\",VLOOKUP($A179,GYPSY_Projected!$C$1:$BH$252,51,FALSE))","v":272.63321253008803},{"$f":"IF(ISNA(VLOOKUP($A179,GYPSY_Projected!$C$1:$BH$252,52,FALSE)),\"\",VLOOKUP($A179,GYPSY_Projected!$C$1:$BH$252,52,FALSE))","v":3.8947601790012576},{"$f":"IF(ISNA(IF(B179>=5,VLOOKUP($A179,GYPSY_Projected!$C$1:$BH$252,34,FALSE)/B179,0)),\"\",IF(B179>=5,(VLOOKUP($A179,GYPSY_Projected!$C$1:$BH$252,16,FALSE)+VLOOKUP($A179,GYPSY_Projected!$C$1:$BH$252,25,FALSE)+VLOOKUP($A179,GYPSY_Projected!$C$1:$BH$252,34,FALSE))/B179,\"\"))","v":4.3998399589130246},{"$f":"IF(ISNA(VLOOKUP($A179,GYPSY_Projected!$C$1:$BH$252,54,FALSE)),\"\",VLOOKUP($A179,GYPSY_Projected!$C$1:$BH$252,54,FALSE))","v":2.3665201617022777},{"$f":"IF(ISNA(VLOOKUP($A179,GYPSY_Projected!$C$1:$BH$252,55,FALSE)),\"\",VLOOKUP($A179,GYPSY_Projected!$C$1:$BH$252,55,FALSE))","v":3.3807430881461112E-2},{"$f":"IF(ISNA(IF(E179>=5,VLOOKUP($A179,GYPSY_Projected!$C$1:$BH$252,7,FALSE)/E179,0)),\"\",IF(E179>=5,VLOOKUP($A179,GYPSY_Projected!$C$1:$BH$252,7,FALSE)/E179,\"\"))","v":""},{"$f":"IF(ISNA(VLOOKUP($A179,GYPSY_Projected!$C$1:$BH$252,57,FALSE)),\"\",VLOOKUP($A179,GYPSY_Projected!$C$1:$BH$252,57,FALSE))","v":274.99973269179031},{"$f":"IF(ISNA(VLOOKUP($A179,GYPSY_Projected!$C$1:$BH$252,58,FALSE)),\"\",VLOOKUP($A179,GYPSY_Projected!$C$1:$BH$252,58,FALSE))","v":3.9285676098827187}]
[80,{"$f":"IF(ISNA(VLOOKUP($A180,GYPSY_Projected!$C$1:$BH$252,51,FALSE)),\"\",VLOOKUP($A180,GYPSY_Projected!$C$1:$BH$252,51,FALSE))","v":330.43584548890061},{"$f":"IF(ISNA(VLOOKUP($A180,GYPSY_Projected!$C$1:$BH$252,52,FALSE)),\"\",VLOOKUP($A180,GYPSY_Projected!$C$1:$BH$252,52,FALSE))","v":4.1304480686112575},{"$f":"IF(ISNA(IF(B180>=5,VLOOKUP($A180,GYPSY_Projected!$C$1:$BH$252,34,FALSE)/B180,0)),\"\",IF(B180>=5,(VLOOKUP($A180,GYPSY_Projected!$C$1:$BH$252,16,FALSE)+VLOOKUP($A180,GYPSY_Projected!$C$1:$BH$252,25,FALSE)+VLOOKUP($A180,GYPSY_Projected!$C$1:$BH$252,34,FALSE))/B180,\"\"))","v":3.236545349018451},{"$f":"IF(ISNA(VLOOKUP($A180,GYPSY_Projected!$C$1:$BH$252,54,FALSE)),\"\",VLOOKUP($A180,GYPSY_Projected!$C$1:$BH$252,54,FALSE))","v":1.8103247628432815},{"$f":"IF(ISNA(VLOOKUP($A180,GYPSY_Projected!$C$1:$BH$252,55,FALSE)),\"\",VLOOKUP($A180,GYPSY_Projected!$C$1:$BH$252,55,FALSE))","v":2.2629059535541018E-2},{"$f":"IF(ISNA(IF(E180>=5,VLOOKUP($A180,GYPSY_Projected!$C$1:$BH$252,7,FALSE)/E180,0)),\"\",IF(E180>=5,VLOOKUP($A180,GYPSY_Projected!$C$1:$BH$252,7,FALSE)/E180,\"\"))","v":""},{"$f":"IF(ISNA(VLOOKUP($A180,GYPSY_Projected!$C$1:$BH$252,57,FALSE)),\"\",VLOOKUP($A180,GYPSY_Projected!$C$1:$BH$252,57,FALSE))","v":332.24617025174388},{"$f":"IF(ISNA(VLOOKUP($A180,GYPSY_Projected!$C$1:$BH$252,58,FALSE)),\"\",VLOOKUP($A180,GYPSY_Projected!$C$1:$BH$252,58,FALSE))","v":4.1530771281467986}]
[90,{"$f":"IF(ISNA(VLOOKUP($A181,GYPSY_Projected!$C$1:$BH$252,51,FALSE)),\"\",VLOOKUP($A181,GYPSY_Projected!$C$1:$BH$252,51,FALSE))","v":370.66874922522544},{"$f":"IF(ISNA(VLOOKUP($A181,GYPSY_Projected!$C$1:$BH$252,52,FALSE)),\"\",VLOOKUP($A181,GYPSY_Projected!$C$1:$BH$252,52,FALSE))","v":4.1185416580580601},{"$f":"IF(ISNA(IF(B181>=5,VLOOKUP($A181,GYPSY_Projected!$C$1:$BH$252,34,FALSE)/B181,0)),\"\",IF(B181>=5,(VLOOKUP($A181,GYPSY_Projected!$C$1:$BH$252,16,FALSE)+VLOOKUP($A181,GYPSY_Projected!$C$1:$BH$252,25,FALSE)+VLOOKUP($A181,GYPSY_Projected!$C$1:$BH$252,34,FALSE))/B181,\"\"))","v":2.5215235289257567},{"$f":"IF(ISNA(VLOOKUP($A181,GYPSY_Projected!$C$1:$BH$252,54,FALSE)),\"\",VLOOKUP($A181,GYPSY_Projected!$C$1:$BH$252,54,FALSE))","v":0.70167885864124413},{"$f":"IF(ISNA(VLOOKUP($A181,GYPSY_Projected!$C$1:$BH$252,55,FALSE)),\"\",VLOOKUP($A181,GYPSY_Projected!$C$1:$BH$252,55,FALSE))","v":7.7964317626804903E-3},{"$f":"IF(ISNA(IF(E181>=5,VLOOKUP($A181,GYPSY_Projected!$C$1:$BH$252,7,FALSE)/E181,0)),\"\",IF(E181>=5,VLOOKUP($A181,GYPSY_Projected!$C$1:$BH$252,7,FALSE)/E181,\"\"))","v":""},{"$f":"IF(ISNA(VLOOKUP($A181,GYPSY_Projected!$C$1:$BH$252,57,FALSE)),\"\",VLOOKUP($A181,GYPSY_Projected!$C$1:$BH$252,57,FALSE))","v":371.37042808386667},{"$f":"IF(ISNA(VLOOKUP($A181,GYPSY_Projected!$C$1:$BH$252,58,FALSE)),\"\",VLOOKUP($A181,GYPSY_Projected!$C$1:$BH$252,58,FALSE))","v":4.1263380898207407}]
[100,{"$f":"IF(ISNA(VLOOKUP($A182,GYPSY_Projected!$C$1:$BH$252,51,FALSE)),\"\",VLOOKUP($A182,GYPSY_Projected!$C$1:$BH$252,51,FALSE))","v":398.96519829708507},{"$f":"IF(ISNA(VLOOKUP($A182,GYPSY_Projected!$C$1:$BH$252,52,FALSE)),\"\",VLOOKUP($A182,GYPSY_Projected!$C$1:$BH$252,52,FALSE))","v":3.9896519829708508},{"$f":"IF(ISNA(IF(B182>=5,VLOOKUP($A182,GYPSY_Projected!$C$1:$BH$252,34,FALSE)/B182,0)),\"\",IF(B182>=5,(VLOOKUP($A182,GYPSY_Projected!$C$1:$BH$252,16,FALSE)+VLOOKUP($A182,GYPSY_Projected!$C$1:$BH$252,25,FALSE)+VLOOKUP($A182,GYPSY_Projected!$C$1:$BH$252,34,FALSE))/B182,\"\"))","v":2.0329132473510585},{"$f":"IF(ISNA(VLOOKUP($A182,GYPSY_Projected!$C$1:$BH$252,54,FALSE)),\"\",VLOOKUP($A182,GYPSY_Projected!$C$1:$BH$252,54,FALSE))","v":6.1009270194403221E-4},{"$f":"IF(ISNA(VLOOKUP($A182,GYPSY_Projected!$C$1:$BH$252,55,FALSE)),\"\",VLOOKUP($A182,GYPSY_Projected!$C$1:$BH$252,55,FALSE))","v":6.1009270194403218E-6},{"$f":"IF(ISNA(IF(E182>=5,VLOOKUP($A182,GYPSY_Projected!$C$1:$BH$252,7,FALSE)/E182,0)),\"\",IF(E182>=5,VLOOKUP($A182,GYPSY_Projected!$C$1:$BH$252,7,FALSE)/E182,\"\"))","v":""},{"$f":"IF(ISNA(VLOOKUP($A182,GYPSY_Projected!$C$1:$BH$252,57,FALSE)),\"\",VLOOKUP($A182,GYPSY_Projected!$C$1:$BH$252,57,FALSE))","v":398.96580838978701},{"$f":"IF(ISNA(VLOOKUP($A182,GYPSY_Projected!$C$1:$BH$252,58,FALSE)),\"\",VLOOKUP($A182,GYPSY_Projected!$C$1:$BH$252,58,FALSE))","v":3.9896580838978704}]
[110,{"$f":"IF(ISNA(VLOOKUP($A183,GYPSY_Projected!$C$1:$BH$252,51,FALSE)),\"\",VLOOKUP($A183,GYPSY_Projected!$C$1:$BH$252,51,FALSE))","v":419.33537047089743},{"$f":"IF(ISNA(VLOOKUP($A183,GYPSY_Projected!$C$1:$BH$252,52,FALSE)),\"\",VLOOKUP($A183,GYPSY_Projected!$C$1:$BH$252,52,FALSE))","v":3.812139731553613},{"$f":"IF(ISNA(IF(B183>=5,VLOOKUP($A183,GYPSY_Projected!$C$1:$BH$252,34,FALSE)/B183,0)),\"\",IF(B183>=5,(VLOOKUP($A183,GYPSY_Projected!$C$1:$BH$252,16,FALSE)+VLOOKUP($A183,GYPSY_Projected!$C$1:$BH$252,25,FALSE)+VLOOKUP($A183,GYPSY_Projected!$C$1:$BH$252,34,FALSE))/B183,\"\"))","v":1.6774894600475287},{"$f":"IF(ISNA(VLOOKUP($A183,GYPSY_Projected!$C$1:$BH$252,54,FALSE)),\"\",VLOOKUP($A183,GYPSY_Projected!$C$1:$BH$252,54,FALSE))","v":0},{"$f":"IF(ISNA(VLOOKUP($A183,GYPSY_Projected!$C$1:$BH$252,55,FALSE)),\"\",VLOOKUP($A183,GYPSY_Projected!$C$1:$BH$252,55,FALSE))","v":0},{"$f":"IF(ISNA(IF(E183>=5,VLOOKUP($A183,GYPSY_Projected!$C$1:$BH$252,7,FALSE)/E183,0)),\"\",IF(E183>=5,VLOOKUP($A183,GYPSY_Projected!$C$1:$BH$252,7,FALSE)/E183,\"\"))","v":""},{"$f":"IF(ISNA(VLOOKUP($A183,GYPSY_Projected!$C$1:$BH$252,57,FALSE)),\"\",VLOOKUP($A183,GYPSY_Projected!$C$1:$BH$252,57,FALSE))","v":419.33537047089743},{"$f":"IF(ISNA(VLOOKUP($A183,GYPSY_Projected!$C$1:$BH$252,58,FALSE)),\"\",VLOOKUP($A183,GYPSY_Projected!$C$1:$BH$252,58,FALSE))","v":3.812139731553613}]
[120,{"$f":"IF(ISNA(VLOOKUP($A184,GYPSY_Projected!$C$1:$BH$252,51,FALSE)),\"\",VLOOKUP($A184,GYPSY_Projected!$C$1:$BH$252,51,FALSE))","v":434.34933549274541},{"$f":"IF(ISNA(VLOOKUP($A184,GYPSY_Projected!$C$1:$BH$252,52,FALSE)),\"\",VLOOKUP($A184,GYPSY_Projected!$C$1:$BH$252,52,FALSE))","v":3.6195777957728783},{"$f":"IF(ISNA(IF(B184>=5,VLOOKUP($A184,GYPSY_Projected!$C$1:$BH$252,34,FALSE)/B184,0)),\"\",IF(B184>=5,(VLOOKUP($A184,GYPSY_Projected!$C$1:$BH$252,16,FALSE)+VLOOKUP($A184,GYPSY_Projected!$C$1:$BH$252,25,FALSE)+VLOOKUP($A184,GYPSY_Projected!$C$1:$BH$252,34,FALSE))/B184,\"\"))","v":1.4085415415175355},{"$f":"IF(ISNA(VLOOKUP($A184,GYPSY_Projected!$C$1:$BH$252,54,FALSE)),\"\",VLOOKUP($A184,GYPSY_Projected!$C$1:$BH$252,54,FALSE))","v":0},{"$f":"IF(ISNA(VLOOKUP($A184,GYPSY_Projected!$C$1:$BH$252,55,FALSE)),\"\",VLOOKUP($A184,GYPSY_Projected!$C$1:$BH$252,55,FALSE))","v":0},{"$f":"IF(ISNA(IF(E184>=5,VLOOKUP($A184,GYPSY_Projected!$C$1:$BH$252,7,FALSE)/E184,0)),\"\",IF(E184>=5,VLOOKUP($A184,GYPSY_Projected!$C$1:$BH$252,7,FALSE)/E184,\"\"))","v":""},{"$f":"IF(ISNA(VLOOKUP($A184,GYPSY_Projected!$C$1:$BH$252,57,FALSE)),\"\",VLOOKUP($A184,GYPSY_Projected!$C$1:$BH$252,57,FALSE))","v":434.34933549274541},{"$f":"IF(ISNA(VLOOKUP($A184,GYPSY_Projected!$C$1:$BH$252,58,FALSE)),\"\",VLOOKUP($A184,GYPSY_Projected!$C$1:$BH$252,58,FALSE))","v":3.6195777957728783}]
[130,{"$f":"IF(ISNA(VLOOKUP($A185,GYPSY_Projected!$C$1:$BH$252,51,FALSE)),\"\",VLOOKUP($A185,GYPSY_Projected!$C$1:$BH$252,51,FALSE))","v":445.64838291940453},{"$f":"IF(ISNA(VLOOKUP($A185,GYPSY_Projected!$C$1:$BH$252,52,FALSE)),\"\",VLOOKUP($A185,GYPSY_Projected!$C$1:$BH$252,52,FALSE))","v":3.4280644839954193},{"$f":"IF(ISNA(IF(B185>=5,VLOOKUP($A185,GYPSY_Projected!$C$1:$BH$252,34,FALSE)/B185,0)),\"\",IF(B185>=5,(VLOOKUP($A185,GYPSY_Projected!$C$1:$BH$252,16,FALSE)+VLOOKUP($A185,GYPSY_Projected!$C$1:$BH$252,25,FALSE)+VLOOKUP($A185,GYPSY_Projected!$C$1:$BH$252,34,FALSE))/B185,\"\"))","v":1.19938313216436},{"$f":"IF(ISNA(VLOOKUP($A185,GYPSY_Projected!$C$1:$BH$252,54,FALSE)),\"\",VLOOKUP($A185,GYPSY_Projected!$C$1:$BH$252,54,FALSE))","v":0},{"$f":"IF(ISNA(VLOOKUP($A185,GYPSY_Projected!$C$1:$BH$252,55,FALSE)),\"\",VLOOKUP($A185,GYPSY_Projected!$C$1:$BH$252,55,FALSE))","v":0},{"$f":"IF(ISNA(IF(E185>=5,VLOOKUP($A185,GYPSY_Projected!$C$1:$BH$252,7,FALSE)/E185,0)),\"\",IF(E185>=5,VLOOKUP($A185,GYPSY_Projected!$C$1:$BH$252,7,FALSE)/E185,\"\"))","v":""},{"$f":"IF(ISNA(VLOOKUP($A185,GYPSY_Projected!$C$1:$BH$252,57,FALSE)),\"\",VLOOKUP($A185,GYPSY_Projected!$C$1:$BH$252,57,FALSE))","v":445.64838291940453},{"$f":"IF(ISNA(VLOOKUP($A185,GYPSY_Projected!$C$1:$BH$252,58,FALSE)),\"\",VLOOKUP($A185,GYPSY_Projected!$C$1:$BH$252,58,FALSE))","v":3.4280644839954193}]
[140,{"$f":"IF(ISNA(VLOOKUP($A186,GYPSY_Projected!$C$1:$BH$252,51,FALSE)),\"\",VLOOKUP($A186,GYPSY_Projected!$C$1:$BH$252,51,FALSE))","v":454.30200146539278},{"$f":"IF(ISNA(VLOOKUP($A186,GYPSY_Projected!$C$1:$BH$252,52,FALSE)),\"\",VLOOKUP($A186,GYPSY_Projected!$C$1:$BH$252,52,FALSE))","v":3.245014296181377},{"$f":"IF(ISNA(IF(B186>=5,VLOOKUP($A186,GYPSY_Projected!$C$1:$BH$252,34,FALSE)/B186,0)),\"\",IF(B186>=5,(VLOOKUP($A186,GYPSY_Projected!$C$1:$BH$252,16,FALSE)+VLOOKUP($A186,GYPSY_Projected!$C$1:$BH$252,25,FALSE)+VLOOKUP($A186,GYPSY_Projected!$C$1:$BH$252,34,FALSE))/B186,\"\"))","v":1.0333320050475767},{"$f":"IF(ISNA(VLOOKUP($A186,GYPSY_Projected!$C$1:$BH$252,54,FALSE)),\"\",VLOOKUP($A186,GYPSY_Projected!$C$1:$BH$252,54,FALSE))","v":0},{"$f":"IF(ISNA(VLOOKUP($A186,GYPSY_Projected!$C$1:$BH$252,55,FALSE)),\"\",VLOOKUP($A186,GYPSY_Projected!$C$1:$BH$252,55,FALSE))","v":0},{"$f":"IF(ISNA(IF(E186>=5,VLOOKUP($A186,GYPSY_Projected!$C$1:$BH$252,7,FALSE)/E186,0)),\"\",IF(E186>=5,VLOOKUP($A186,GYPSY_Projected!$C$1:$BH$252,7,FALSE)/E186,\"\"))","v":""},{"$f":"IF(ISNA(VLOOKUP($A186,GYPSY_Projected!$C$1:$BH$252,57,FALSE)),\"\",VLOOKUP($A186,GYPSY_Projected!$C$1:$BH$252,57,FALSE))","v":454.30200146539278},{"$f":"IF(ISNA(VLOOKUP($A186,GYPSY_Projected!$C$1:$BH$252,58,FALSE)),\"\",VLOOKUP($A186,GYPSY_Projected!$C$1:$BH$252,58,FALSE))","v":3.245014296181377}]
[150,{"$f":"IF(ISNA(VLOOKUP($A187,GYPSY_Projected!$C$1:$BH$252,51,FALSE)),\"\",VLOOKUP($A187,GYPSY_Projected!$C$1:$BH$252,51,FALSE))","v":461.02349504448932},{"$f":"IF(ISNA(VLOOKUP($A187,GYPSY_Projected!$C$1:$BH$252,52,FALSE)),\"\",VLOOKUP($A187,GYPSY_Projected!$C$1:$BH$252,52,FALSE))","v":3.0734899669632623},{"$f":"IF(ISNA(IF(B187>=5,VLOOKUP($A187,GYPSY_Projected!$C$1:$BH$252,34,FALSE)/B187,0)),\"\",IF(B187>=5,(VLOOKUP($A187,GYPSY_Projected!$C$1:$BH$252,16,FALSE)+VLOOKUP($A187,GYPSY_Projected!$C$1:$BH$252,25,FALSE)+VLOOKUP($A187,GYPSY_Projected!$C$1:$BH$252,34,FALSE))/B187,\"\"))","v":0.89930370997219511},{"$f":"IF(ISNA(VLOOKUP($A187,GYPSY_Projected!$C$1:$BH$252,54,FALSE)),\"\",VLOOKUP($A187,GYPSY_Projected!$C$1:$BH$252,54,FALSE))","v":0},{"$f":"IF(ISNA(VLOOKUP($A187,GYPSY_Projected!$C$1:$BH$252,55,FALSE)),\"\",VLOOKUP($A187,GYPSY_Projected!$C$1:$BH$252,55,FALSE))","v":0},{"$f":"IF(ISNA(IF(E187>=5,VLOOKUP($A187,GYPSY_Projected!$C$1:$BH$252,7,FALSE)/E187,0)),\"\",IF(E187>=5,VLOOKUP($A187,GYPSY_Projected!$C$1:$BH$252,7,FALSE)/E187,\"\"))","v":""},{"$f":"IF(ISNA(VLOOKUP($A187,GYPSY_Projected!$C$1:$BH$252,57,FALSE)),\"\",VLOOKUP($A187,GYPSY_Projected!$C$1:$BH$252,57,FALSE))","v":461.02349504448932},{"$f":"IF(ISNA(VLOOKUP($A187,GYPSY_Projected!$C$1:$BH$252,58,FALSE)),\"\",VLOOKUP($A187,GYPSY_Projected!$C$1:$BH$252,58,FALSE))","v":3.0734899669632623}]
[160,{"$f":"IF(ISNA(VLOOKUP($A188,GYPSY_Projected!$C$1:$BH$252,51,FALSE)),\"\",VLOOKUP($A188,GYPSY_Projected!$C$1:$BH$252,51,FALSE))","v":466.29913645473641},{"$f":"IF(ISNA(VLOOKUP($A188,GYPSY_Projected!$C$1:$BH$252,52,FALSE)),\"\",VLOOKUP($A188,GYPSY_Projected!$C$1:$BH$252,52,FALSE))","v":2.9143696028421027},{"$f":"IF(ISNA(IF(B188>=5,VLOOKUP($A188,GYPSY_Projected!$C$1:$BH$252,34,FALSE)/B188,0)),\"\",IF(B188>=5,(VLOOKUP($A188,GYPSY_Projected!$C$1:$BH$252,16,FALSE)+VLOOKUP($A188,GYPSY_Projected!$C$1:$BH$252,25,FALSE)+VLOOKUP($A188,GYPSY_Projected!$C$1:$BH$252,34,FALSE))/B188,\"\"))","v":0.78961230387312109},{"$f":"IF(ISNA(VLOOKUP($A188,GYPSY_Projected!$C$1:$BH$252,54,FALSE)),\"\",VLOOKUP($A188,GYPSY_Projected!$C$1:$BH$252,54,FALSE))","v":0},{"$f":"IF(ISNA(VLOOKUP($A188,GYPSY_Projected!$C$1:$BH$252,55,FALSE)),\"\",VLOOKUP($A188,GYPSY_Projected!$C$1:$BH$252,55,FALSE))","v":0},{"$f":"IF(ISNA(IF(E188>=5,VLOOKUP($A188,GYPSY_Projected!$C$1:$BH$252,7,FALSE)/E188,0)),\"\",IF(E188>=5,VLOOKUP($A188,GYPSY_Projected!$C$1:$BH$252,7,FALSE)/E188,\"\"))","v":""},{"$f":"IF(ISNA(VLOOKUP($A188,GYPSY_Projected!$C$1:$BH$252,57,FALSE)),\"\",VLOOKUP($A188,GYPSY_Projected!$C$1:$BH$252,57,FALSE))","v":466.29913645473641},{"$f":"IF(ISNA(VLOOKUP($A188,GYPSY_Projected!$C$1:$BH$252,58,FALSE)),\"\",VLOOKUP($A188,GYPSY_Projected!$C$1:$BH$252,58,FALSE))","v":2.9143696028421027}]
[170,{"$f":"IF(ISNA(VLOOKUP($A189,GYPSY_Projected!$C$1:$BH$252,51,FALSE)),\"\",VLOOKUP($A189,GYPSY_Projected!$C$1:$BH$252,51,FALSE))","v":470.46726345482739},{"$f":"IF(ISNA(VLOOKUP($A189,GYPSY_Projected!$C$1:$BH$252,52,FALSE)),\"\",VLOOKUP($A189,GYPSY_Projected!$C$1:$BH$252,52,FALSE))","v":2.7674544909107492},{"$f":"IF(ISNA(IF(B189>=5,VLOOKUP($A189,GYPSY_Projected!$C$1:$BH$252,34,FALSE)/B189,0)),\"\",IF(B189>=5,(VLOOKUP($A189,GYPSY_Projected!$C$1:$BH$252,16,FALSE)+VLOOKUP($A189,GYPSY_Projected!$C$1:$BH$252,25,FALSE)+VLOOKUP($A189,GYPSY_Projected!$C$1:$BH$252,34,FALSE))/B189,\"\"))","v":0.69875879251131068},{"$f":"IF(ISNA(VLOOKUP($A189,GYPSY_Projected!$C$1:$BH$252,54,FALSE)),\"\",VLOOKUP($A189,GYPSY_Projected!$C$1:$BH$252,54,FALSE))","v":0},{"$f":"IF(ISNA(VLOOKUP($A189,GYPSY_Projected!$C$1:$BH$252,55,FALSE)),\"\",VLOOKUP($A189,GYPSY_Projected!$C$1:$BH$252,55,FALSE))","v":0},{"$f":"IF(ISNA(IF(E189>=5,VLOOKUP($A189,GYPSY_Projected!$C$1:$BH$252,7,FALSE)/E189,0)),\"\",IF(E189>=5,VLOOKUP($A189,GYPSY_Projected!$C$1:$BH$252,7,FALSE)/E189,\"\"))","v":""},{"$f":"IF(ISNA(VLOOKUP($A189,GYPSY_Projected!$C$1:$BH$252,57,FALSE)),\"\",VLOOKUP($A189,GYPSY_Projected!$C$1:$BH$252,57,FALSE))","v":470.46726345482739},{"$f":"IF(ISNA(VLOOKUP($A189,GYPSY_Projected!$C$1:$BH$252,58,FALSE)),\"\",VLOOKUP($A189,GYPSY_Projected!$C$1:$BH$252,58,FALSE))","v":2.7674544909107492}]
[180,{"$f":"IF(ISNA(VLOOKUP($A190,GYPSY_Projected!$C$1:$BH$252,51,FALSE)),\"\",VLOOKUP($A190,GYPSY_Projected!$C$1:$BH$252,51,FALSE))","v":473.76796252230872},{"$f":"IF(ISNA(VLOOKUP($A190,GYPSY_Projected!$C$1:$BH$252,52,FALSE)),\"\",VLOOKUP($A190,GYPSY_Projected!$C$1:$BH$252,52,FALSE))","v":2.6320442362350485},{"$f":"IF(ISNA(IF(B190>=5,VLOOKUP($A190,GYPSY_Projected!$C$1:$BH$252,34,FALSE)/B190,0)),\"\",IF(B190>=5,(VLOOKUP($A190,GYPSY_Projected!$C$1:$BH$252,16,FALSE)+VLOOKUP($A190,GYPSY_Projected!$C$1:$BH$252,25,FALSE)+VLOOKUP($A190,GYPSY_Projected!$C$1:$BH$252,34,FALSE))/B190,\"\"))","v":0.62271239817191337},{"$f":"IF(ISNA(VLOOKUP($A190,GYPSY_Projected!$C$1:$BH$252,54,FALSE)),\"\",VLOOKUP($A190,GYPSY_Projected!$C$1:$BH$252,54,FALSE))","v":0},{"$f":"IF(ISNA(VLOOKUP($A190,GYPSY_Projected!$C$1:$BH$252,55,FALSE)),\"\",VLOOKUP($A190,GYPSY_Projected!$C$1:$BH$252,55,FALSE))","v":0},{"$f":"IF(ISNA(IF(E190>=5,VLOOKUP($A190,GYPSY_Projected!$C$1:$BH$252,7,FALSE)/E190,0)),\"\",IF(E190>=5,VLOOKUP($A190,GYPSY_Projected!$C$1:$BH$252,7,FALSE)/E190,\"\"))","v":""},{"$f":"IF(ISNA(VLOOKUP($A190,GYPSY_Projected!$C$1:$BH$252,57,FALSE)),\"\",VLOOKUP($A190,GYPSY_Projected!$C$1:$BH$252,57,FALSE))","v":473.76796252230872},{"$f":"IF(ISNA(VLOOKUP($A190,GYPSY_Projected!$C$1:$BH$252,58,FALSE)),\"\",VLOOKUP($A190,GYPSY_Projected!$C$1:$BH$252,58,FALSE))","v":2.6320442362350485}]
[190,{"$f":"IF(ISNA(VLOOKUP($A191,GYPSY_Projected!$C$1:$BH$252,51,FALSE)),\"\",VLOOKUP($A191,GYPSY_Projected!$C$1:$BH$252,51,FALSE))","v":476.37496103849963},{"$f":"IF(ISNA(VLOOKUP($A191,GYPSY_Projected!$C$1:$BH$252,52,FALSE)),\"\",VLOOKUP($A191,GYPSY_Projected!$C$1:$BH$252,52,FALSE))","v":2.507236637044735},{"$f":"IF(ISNA(IF(B191>=5,VLOOKUP($A191,GYPSY_Projected!$C$1:$BH$252,34,FALSE)/B191,0)),\"\",IF(B191>=5,(VLOOKUP($A191,GYPSY_Projected!$C$1:$BH$252,16,FALSE)+VLOOKUP($A191,GYPSY_Projected!$C$1:$BH$252,25,FALSE)+VLOOKUP($A191,GYPSY_Projected!$C$1:$BH$252,34,FALSE))/B191,\"\"))","v":0.55846005539144916},{"$f":"IF(ISNA(VLOOKUP($A191,GYPSY_Projected!$C$1:$BH$252,54,FALSE)),\"\",VLOOKUP($A191,GYPSY_Projected!$C$1:$BH$252,54,FALSE))","v":0},{"$f":"IF(ISNA(VLOOKUP($A191,GYPSY_Projected!$C$1:$BH$252,55,FALSE)),\"\",VLOOKUP($A191,GYPSY_Projected!$C$1:$BH$252,55,FALSE))","v":0},{"$f":"IF(ISNA(IF(E191>=5,VLOOKUP($A191,GYPSY_Projected!$C$1:$BH$252,7,FALSE)/E191,0)),\"\",IF(E191>=5,VLOOKUP($A191,GYPSY_Projected!$C$1:$BH$252,7,FALSE)/E191,\"\"))","v":""},{"$f":"IF(ISNA(VLOOKUP($A191,GYPSY_Projected!$C$1:$BH$252,57,FALSE)),\"\",VLOOKUP($A191,GYPSY_Projected!$C$1:$BH$252,57,FALSE))","v":476.37496103849963},{"$f":"IF(ISNA(VLOOKUP($A191,GYPSY_Projected!$C$1:$BH$252,58,FALSE)),\"\",VLOOKUP($A191,GYPSY_Projected!$C$1:$BH$252,58,FALSE))","v":2.507236637044735}]
[200,{"$f":"IF(ISNA(VLOOKUP($A192,GYPSY_Projected!$C$1:$BH$252,51,FALSE)),\"\",VLOOKUP($A192,GYPSY_Projected!$C$1:$BH$252,51,FALSE))","v":478.4164591043035},{"$f":"IF(ISNA(VLOOKUP($A192,GYPSY_Projected!$C$1:$BH$252,52,FALSE)),\"\",VLOOKUP($A192,GYPSY_Projected!$C$1:$BH$252,52,FALSE))","v":2.3920822955215173},{"$f":"IF(ISNA(IF(B192>=5,VLOOKUP($A192,GYPSY_Projected!$C$1:$BH$252,34,FALSE)/B192,0)),\"\",IF(B192>=5,(VLOOKUP($A192,GYPSY_Projected!$C$1:$BH$252,16,FALSE)+VLOOKUP($A192,GYPSY_Projected!$C$1:$BH$252,25,FALSE)+VLOOKUP($A192,GYPSY_Projected!$C$1:$BH$252,34,FALSE))/B192,\"\"))","v":0.50371208150308411},{"$f":"IF(ISNA(VLOOKUP($A192,GYPSY_Projected!$C$1:$BH$252,54,FALSE)),\"\",VLOOKUP($A192,GYPSY_Projected!$C$1:$BH$252,54,FALSE))","v":0},{"$f":"IF(ISNA(VLOOKUP($A192,GYPSY_Projected!$C$1:$BH$252,55,FALSE)),\"\",VLOOKUP($A192,GYPSY_Projected!$C$1:$BH$252,55,FALSE))","v":0},{"$f":"IF(ISNA(IF(E192>=5,VLOOKUP($A192,GYPSY_Projected!$C$1:$BH$252,7,FALSE)/E192,0)),\"\",IF(E192>=5,VLOOKUP($A192,GYPSY_Projected!$C$1:$BH$252,7,FALSE)/E192,\"\"))","v":""},{"$f":"IF(ISNA(VLOOKUP($A192,GYPSY_Projected!$C$1:$BH$252,57,FALSE)),\"\",VLOOKUP($A192,GYPSY_Projected!$C$1:$BH$252,57,FALSE))","v":478.4164591043035},{"$f":"IF(ISNA(VLOOKUP($A192,GYPSY_Projected!$C$1:$BH$252,58,FALSE)),\"\",VLOOKUP($A192,GYPSY_Projected!$C$1:$BH$252,58,FALSE))","v":2.3920822955215173}]
[210,{"$f":"IF(ISNA(VLOOKUP($A193,GYPSY_Projected!$C$1:$BH$252,51,FALSE)),\"\",VLOOKUP($A193,GYPSY_Projected!$C$1:$BH$252,51,FALSE))","v":479.98893398934604},{"$f":"IF(ISNA(VLOOKUP($A193,GYPSY_Projected!$C$1:$BH$252,52,FALSE)),\"\",VLOOKUP($A193,GYPSY_Projected!$C$1:$BH$252,52,FALSE))","v":2.2856615904254571},{"$f":"IF(ISNA(IF(B193>=5,VLOOKUP($A193,GYPSY_Projected!$C$1:$BH$252,34,FALSE)/B193,0)),\"\",IF(B193>=5,(VLOOKUP($A193,GYPSY_Projected!$C$1:$BH$252,16,FALSE)+VLOOKUP($A193,GYPSY_Projected!$C$1:$BH$252,25,FALSE)+VLOOKUP($A193,GYPSY_Projected!$C$1:$BH$252,34,FALSE))/B193,\"\"))","v":0.45670361927648595},{"$f":"IF(ISNA(VLOOKUP($A193,GYPSY_Projected!$C$1:$BH$252,54,FALSE)),\"\",VLOOKUP($A193,GYPSY_Projected!$C$1:$BH$252,54,FALSE))","v":0},{"$f":"IF(ISNA(VLOOKUP($A193,GYPSY_Projected!$C$1:$BH$252,55,FALSE)),\"\",VLOOKUP($A193,GYPSY_Projected!$C$1:$BH$252,55,FALSE))","v":0},{"$f":"IF(ISNA(IF(E193>=5,VLOOKUP($A193,GYPSY_Projected!$C$1:$BH$252,7,FALSE)/E193,0)),\"\",IF(E193>=5,VLOOKUP($A193,GYPSY_Projected!$C$1:$BH$252,7,FALSE)/E193,\"\"))","v":""},{"$f":"IF(ISNA(VLOOKUP($A193,GYPSY_Projected!$C$1:$BH$252,57,FALSE)),\"\",VLOOKUP($A193,GYPSY_Projected!$C$1:$BH$252,57,FALSE))","v":479.98893398934604},{"$f":"IF(ISNA(VLOOKUP($A193,GYPSY_Projected!$C$1:$BH$252,58,FALSE)),\"\",VLOOKUP($A193,GYPSY_Projected!$C$1:$BH$252,58,FALSE))","v":2.2856615904254571}]
[220,{"$f":"IF(ISNA(VLOOKUP($A194,GYPSY_Projected!$C$1:$BH$252,51,FALSE)),\"\",VLOOKUP($A194,GYPSY_Projected!$C$1:$BH$252,51,FALSE))","v":481.16640486585766},{"$f":"IF(ISNA(VLOOKUP($A194,GYPSY_Projected!$C$1:$BH$252,52,FALSE)),\"\",VLOOKUP($A194,GYPSY_Projected!$C$1:$BH$252,52,FALSE))","v":2.1871200221175346},{"$f":"IF(ISNA(IF(B194>=5,VLOOKUP($A194,GYPSY_Projected!$C$1:$BH$252,34,FALSE)/B194,0)),\"\",IF(B194>=5,(VLOOKUP($A194,GYPSY_Projected!$C$1:$BH$252,16,FALSE)+VLOOKUP($A194,GYPSY_Projected!$C$1:$BH$252,25,FALSE)+VLOOKUP($A194,GYPSY_Projected!$C$1:$BH$252,34,FALSE))/B194,\"\"))","v":0.41605721694670084},{"$f":"IF(ISNA(VLOOKUP($A194,GYPSY_Projected!$C$1:$BH$252,54,FALSE)),\"\",VLOOKUP($A194,GYPSY_Projected!$C$1:$BH$252,54,FALSE))","v":0},{"$f":"IF(ISNA(VLOOKUP($A194,GYPSY_Projected!$C$1:$BH$252,55,FALSE)),\"\",VLOOKUP($A194,GYPSY_Projected!$C$1:$BH$252,55,FALSE))","v":0},{"$f":"IF(ISNA(IF(E194>=5,VLOOKUP($A194,GYPSY_Projected!$C$1:$BH$252,7,FALSE)/E194,0)),\"\",IF(E194>=5,VLOOKUP($A194,GYPSY_Projected!$C$1:$BH$252,7,FALSE)/E194,\"\"))","v":""},{"$f":"IF(ISNA(VLOOKUP($A194,GYPSY_Projected!$C$1:$BH$252,57,FALSE)),\"\",VLOOKUP($A194,GYPSY_Projected!$C$1:$BH$252,57,FALSE))","v":481.16640486585766},{"$f":"IF(ISNA(VLOOKUP($A194,GYPSY_Projected!$C$1:$BH$252,58,FALSE)),\"\",VLOOKUP($A194,GYPSY_Projected!$C$1:$BH$252,58,FALSE))","v":2.1871200221175346}]
[230,{"$f":"IF(ISNA(VLOOKUP($A195,GYPSY_Projected!$C$1:$BH$252,51,FALSE)),\"\",VLOOKUP($A195,GYPSY_Projected!$C$1:$BH$252,51,FALSE))","v":482.00672683491013},{"$f":"IF(ISNA(VLOOKUP($A195,GYPSY_Projected!$C$1:$BH$252,52,FALSE)),\"\",VLOOKUP($A195,GYPSY_Projected!$C$1:$BH$252,52,FALSE))","v":2.0956814210213484},{"$f":"IF(ISNA(IF(B195>=5,VLOOKUP($A195,GYPSY_Projected!$C$1:$BH$252,34,FALSE)/B195,0)),\"\",IF(B195>=5,(VLOOKUP($A195,GYPSY_Projected!$C$1:$BH$252,16,FALSE)+VLOOKUP($A195,GYPSY_Projected!$C$1:$BH$252,25,FALSE)+VLOOKUP($A195,GYPSY_Projected!$C$1:$BH$252,34,FALSE))/B195,\"\"))","v":0.38068569375949735},{"$f":"IF(ISNA(VLOOKUP($A195,GYPSY_Projected!$C$1:$BH$252,54,FALSE)),\"\",VLOOKUP($A195,GYPSY_Projected!$C$1:$BH$252,54,FALSE))","v":0},{"$f":"IF(ISNA(VLOOKUP($A195,GYPSY_Projected!$C$1:$BH$252,55,FALSE)),\"\",VLOOKUP($A195,GYPSY_Projected!$C$1:$BH$252,55,FALSE))","v":0},{"$f":"IF(ISNA(IF(E195>=5,VLOOKUP($A195,GYPSY_Projected!$C$1:$BH$252,7,FALSE)/E195,0)),\"\",IF(E195>=5,VLOOKUP($A195,GYPSY_Projected!$C$1:$BH$252,7,FALSE)/E195,\"\"))","v":""},{"$f":"IF(ISNA(VLOOKUP($A195,GYPSY_Projected!$C$1:$BH$252,57,FALSE)),\"\",VLOOKUP($A195,GYPSY_Projected!$C$1:$BH$252,57,FALSE))","v":482.00672683491013},{"$f":"IF(ISNA(VLOOKUP($A195,GYPSY_Projected!$C$1:$BH$252,58,FALSE)),\"\",VLOOKUP($A195,GYPSY_Projected!$C$1:$BH$252,58,FALSE))","v":2.0956814210213484}]
[240,{"$f":"IF(ISNA(VLOOKUP($A196,GYPSY_Projected!$C$1:$BH$252,51,FALSE)),\"\",VLOOKUP($A196,GYPSY_Projected!$C$1:$BH$252,51,FALSE))","v":482.55592012786434},{"$f":"IF(ISNA(VLOOKUP($A196,GYPSY_Projected!$C$1:$BH$252,52,FALSE)),\"\",VLOOKUP($A196,GYPSY_Projected!$C$1:$BH$252,52,FALSE))","v":2.0106496671994347},{"$f":"IF(ISNA(IF(B196>=5,VLOOKUP($A196,GYPSY_Projected!$C$1:$BH$252,34,FALSE)/B196,0)),\"\",IF(B196>=5,(VLOOKUP($A196,GYPSY_Projected!$C$1:$BH$252,16,FALSE)+VLOOKUP($A196,GYPSY_Projected!$C$1:$BH$252,25,FALSE)+VLOOKUP($A196,GYPSY_Projected!$C$1:$BH$252,34,FALSE))/B196,\"\"))","v":0.34972224246943584},{"$f":"IF(ISNA(VLOOKUP($A196,GYPSY_Projected!$C$1:$BH$252,54,FALSE)),\"\",VLOOKUP($A196,GYPSY_Projected!$C$1:$BH$252,54,FALSE))","v":0},{"$f":"IF(ISNA(VLOOKUP($A196,GYPSY_Projected!$C$1:$BH$252,55,FALSE)),\"\",VLOOKUP($A196,GYPSY_Projected!$C$1:$BH$252,55,FALSE))","v":0},{"$f":"IF(ISNA(IF(E196>=5,VLOOKUP($A196,GYPSY_Projected!$C$1:$BH$252,7,FALSE)/E196,0)),\"\",IF(E196>=5,VLOOKUP($A196,GYPSY_Projected!$C$1:$BH$252,7,FALSE)/E196,\"\"))","v":""},{"$f":"IF(ISNA(VLOOKUP($A196,GYPSY_Projected!$C$1:$BH$252,57,FALSE)),\"\",VLOOKUP($A196,GYPSY_Projected!$C$1:$BH$252,57,FALSE))","v":482.55592012786434},{"$f":"IF(ISNA(VLOOKUP($A196,GYPSY_Projected!$C$1:$BH$252,58,FALSE)),\"\",VLOOKUP($A196,GYPSY_Projected!$C$1:$BH$252,58,FALSE))","v":2.0106496671994347}]
[250,{"$f":"IF(ISNA(VLOOKUP($A197,GYPSY_Projected!$C$1:$BH$252,51,FALSE)),\"\",VLOOKUP($A197,GYPSY_Projected!$C$1:$BH$252,51,FALSE))","v":482.85118713761199},{"$f":"IF(ISNA(VLOOKUP($A197,GYPSY_Projected!$C$1:$BH$252,52,FALSE)),\"\",VLOOKUP($A197,GYPSY_Projected!$C$1:$BH$252,52,FALSE))","v":1.931404748550448},{"$f":"IF(ISNA(IF(B197>=5,VLOOKUP($A197,GYPSY_Projected!$C$1:$BH$252,34,FALSE)/B197,0)),\"\",IF(B197>=5,(VLOOKUP($A197,GYPSY_Projected!$C$1:$BH$252,16,FALSE)+VLOOKUP($A197,GYPSY_Projected!$C$1:$BH$252,25,FALSE)+VLOOKUP($A197,GYPSY_Projected!$C$1:$BH$252,34,FALSE))/B197,\"\"))","v":0.32246934541482736},{"$f":"IF(ISNA(VLOOKUP($A197,GYPSY_Projected!$C$1:$BH$252,54,FALSE)),\"\",VLOOKUP($A197,GYPSY_Projected!$C$1:$BH$252,54,FALSE))","v":0},{"$f":"IF(ISNA(VLOOKUP($A197,GYPSY_Projected!$C$1:$BH$252,55,FALSE)),\"\",VLOOKUP($A197,GYPSY_Projected!$C$1:$BH$252,55,FALSE))","v":0},{"$f":"IF(ISNA(IF(E197>=5,VLOOKUP($A197,GYPSY_Projected!$C$1:$BH$252,7,FALSE)/E197,0)),\"\",IF(E197>=5,VLOOKUP($A197,GYPSY_Projected!$C$1:$BH$252,7,FALSE)/E197,\"\"))","v":""},{"$f":"IF(ISNA(VLOOKUP($A197,GYPSY_Projected!$C$1:$BH$252,57,FALSE)),\"\",VLOOKUP($A197,GYPSY_Projected!$C$1:$BH$252,57,FALSE))","v":482.85118713761199},{"$f":"IF(ISNA(VLOOKUP($A197,GYPSY_Projected!$C$1:$BH$252,58,FALSE)),\"\",VLOOKUP($A197,GYPSY_Projected!$C$1:$BH$252,58,FALSE))","v":1.931404748550448}]

{"sheet":"Stop Errors","index":12,"n_rows":40,"n_cols":2,"rows_kept":40,"cut":false,"hidden":true,"merged":[]}
["Variable","Condition"]
["ConesMiss",true]
["ElevMiss",true]
["LatMiss",true]
["LFHmiss",true]
["nTwarning","\"Error: thinning target missing\""]
["PlantDataWarning","\"Error: planting density missing\""]
["psAWesMiss",true]
["psSBesMiss",true]
["psSWesMiss",true]
["SlopeMiss",true]
["StandMiss",true]
["StandErrorWarning","\"Inputs for stand and site factors incomplete\""]
["YSCperfEarlyLate","\"Error: performance assessment year missing\""]
["YSCzeroOutNote","\"Error: year of cut missing\""]
["YrPlantWarning","\"Error: planting before cut\""]
["YrPlantWarning","\"Error: planting before site preparation\""]
["YrPlantWarning","\"Error: planting year missing\" "]
["YrPrepWarning","\"Error: site preparation year missing\""]
["YrPrepWarning","\"Error: site preparation before cut\""]
["YrThinWarning","\"Error: thinning year missing\""]
["YrThinWarning","\"Error: thinning too late (in or after handover year)\""]
["YrWeedWarning","\"Error: weeding year missing\""]
["YrWeedWarning","\"Error: weeding before cut\""]
["InElev","<840, >1621"]
["InLat","<51.5, >54.8"]
["InLFH","<2, >57"]
["InSlope","<0, >23"]
["InCones","<0, >30"]
["InPsAWes","<0, >100"]
["InPsSBes","<0, >100"]
["InPsSWes","<0, >100"]
["InYrC","<1980, >2050"]
["InNpInput","<800, >4500"]
["InNt","<500, >5000"]
["YrP","< YrC"]
["YrPerf","< YrC"]
["YrPrep","< YrC"]
["YrThin","< YrC"]
["YrWeed","< YrC"]